BDBM50082706 11-{3-[4-(4-Chloro-phenyl)-4-hydroxy-piperidin-1-yl]-propyl}-6,11-dihydro-dibenzo[b,e]oxepine-11-carbonitrile::CHEMBL343511
SMILES: OC1(CCN(CCCC2(C#N)c3ccccc3COc3ccccc23)CC1)c1ccc(Cl)cc1
InChI Key: InChIKey=YKFWLTHKZUBSHE-UHFFFAOYSA-N
Data: 1 KI  1 IC50
Activity Spreadsheet -- Enzyme Inhibition Constant Data from BindingDB
Found 2 hits for monomerid = 50082706
Trg + Lig
Ki
nM
ΔG°
kcal/mole
IC50
nM
Kd
nM
EC50/IC50
nM
koff
s-1
kon
M-1s-1
pHTemp
°C
C-C chemokine receptor type 1
(Homo sapiens (Human))
BDBM50082706
(11-{3-[4-(4-Chloro-phenyl)-4-hydroxy-piperidin-1-y...)
Show SMILES OC1(CCN(CCCC2(C#N)c3ccccc3COc3ccccc23)CC1)c1ccc(Cl)cc1
Show InChI InChI=1S/C29H29ClN2O2/c30-24-12-10-23(11-13-24)29(33)15-18-32(19-16-29)17-5-14-28(21-31)25-7-2-1-6-22(25)20-34-27-9-4-3-8-26(27)28/h1-4,6-13,33H,5,14-20H2
Reactome pathway
34n/an/an/an/an/an/an/an/a
Berlex Biosciences
Curated by ChEMBL
Assay Description
Inhibition of [125I]-MIP-1 alpha binding to recombinant human C-C chemokine receptor type 1 expressed in HEK293 cells
J Med Chem 42: 4680-94 (1999)
BindingDB Entry DOI: 10.7270/Q2125TCC
C-C chemokine receptor type 1
(Homo sapiens (Human))
BDBM50082706
(11-{3-[4-(4-Chloro-phenyl)-4-hydroxy-piperidin-1-y...)
Show SMILES OC1(CCN(CCCC2(C#N)c3ccccc3COc3ccccc23)CC1)c1ccc(Cl)cc1
Show InChI InChI=1S/C29H29ClN2O2/c30-24-12-10-23(11-13-24)29(33)15-18-32(19-16-29)17-5-14-28(21-31)25-7-2-1-6-22(25)20-34-27-9-4-3-8-26(27)28/h1-4,6-13,33H,5,14-20H2
Reactome pathway
n/an/a 7.70E+3n/an/an/an/an/an/a
Berlex Biosciences
Curated by ChEMBL
Assay Description
Inhibition of MIP-1-alpha-induced intracellular calcium mobilization in HEK293 cells expressing human CCR1 receptor
J Med Chem 42: 4680-94 (1999)
BindingDB Entry DOI: 10.7270/Q2125TCC