null
SMILES: OC1(CCN(CCCC(C#N)c2ccccc2C#N)CC1)c1ccc(Cl)cc1
InChI Key: InChIKey=CEWNKOXWSXXSKW-UHFFFAOYSA-N
Activity Spreadsheet -- Enzyme Inhibition Constant Data from BindingDB
Found 2 hits for monomerid = 50082717
Trg + Lig
Ki
nM
ΔG°
kcal/mole
IC50
nM
Kd
nM
EC50/IC50
nM
koff
s-1
kon
M-1s-1
pHTemp
°C
C-C chemokine receptor type 1
(Homo sapiens (Human))
BDBM50082717
(2-{4-[4-(4-Chloro-phenyl)-4-hydroxy-piperidin-1-yl...)
Show SMILES OC1(CCN(CCCC(C#N)c2ccccc2C#N)CC1)c1ccc(Cl)cc1
Show InChI InChI=1S/C23H24ClN3O/c24-21-9-7-20(8-10-21)23(28)11-14-27(15-12-23)13-3-5-19(17-26)22-6-2-1-4-18(22)16-25/h1-2,4,6-10,19,28H,3,5,11-15H2
Reactome pathway
98n/an/an/an/an/an/an/an/a
Berlex Biosciences
Curated by ChEMBL
Assay Description
Inhibition of [125I]-MIP-1 alpha binding to recombinant human C-C chemokine receptor type 1 expressed in HEK293 cells
J Med Chem 42: 4680-94 (1999)
BindingDB Entry DOI: 10.7270/Q2125TCC
C-C chemokine receptor type 1
(Homo sapiens (Human))
BDBM50082717
(2-{4-[4-(4-Chloro-phenyl)-4-hydroxy-piperidin-1-yl...)
Show SMILES OC1(CCN(CCCC(C#N)c2ccccc2C#N)CC1)c1ccc(Cl)cc1
Show InChI InChI=1S/C23H24ClN3O/c24-21-9-7-20(8-10-21)23(28)11-14-27(15-12-23)13-3-5-19(17-26)22-6-2-1-4-18(22)16-25/h1-2,4,6-10,19,28H,3,5,11-15H2
Reactome pathway
n/an/a 5.80E+3n/an/an/an/an/an/a
Berlex Biosciences
Curated by ChEMBL
Assay Description
Inhibition of MIP-1-alpha-induced intracellular calcium mobilization in HEK293 cells expressing human CCR1 receptor
J Med Chem 42: 4680-94 (1999)
BindingDB Entry DOI: 10.7270/Q2125TCC