BDBM50082720 5-[4-(4-Chloro-phenyl)-4-hydroxy-piperidin-1-yl]-2-cyano-2-phenyl-pentanoic acid ethyl ester::CHEMBL344324
SMILES: CCOC(=O)C(CCCN1CCC(O)(CC1)c1ccc(Cl)cc1)(C#N)c1ccccc1
InChI Key: InChIKey=FLCHLKRLUODAAE-UHFFFAOYSA-N
Data: 1 KI  1 IC50
Activity Spreadsheet -- Enzyme Inhibition Constant Data from BindingDB
Found 2 hits for monomerid = 50082720
Trg + Lig
Ki
nM
ΔG°
kcal/mole
IC50
nM
Kd
nM
EC50/IC50
nM
koff
s-1
kon
M-1s-1
pHTemp
°C
C-C chemokine receptor type 1
(Homo sapiens (Human))
BDBM50082720
(5-[4-(4-Chloro-phenyl)-4-hydroxy-piperidin-1-yl]-2...)
Show SMILES CCOC(=O)C(CCCN1CCC(O)(CC1)c1ccc(Cl)cc1)(C#N)c1ccccc1
Show InChI InChI=1S/C25H29ClN2O3/c1-2-31-23(29)24(19-27,20-7-4-3-5-8-20)13-6-16-28-17-14-25(30,15-18-28)21-9-11-22(26)12-10-21/h3-5,7-12,30H,2,6,13-18H2,1H3
Reactome pathway
33n/an/an/an/an/an/an/an/a
Berlex Biosciences
Curated by ChEMBL
Assay Description
Inhibition of [125I]-MIP-1 alpha binding to recombinant human C-C chemokine receptor type 1 expressed in HEK293 cells
J Med Chem 42: 4680-94 (1999)
BindingDB Entry DOI: 10.7270/Q2125TCC
C-C chemokine receptor type 1
(Homo sapiens (Human))
BDBM50082720
(5-[4-(4-Chloro-phenyl)-4-hydroxy-piperidin-1-yl]-2...)
Show SMILES CCOC(=O)C(CCCN1CCC(O)(CC1)c1ccc(Cl)cc1)(C#N)c1ccccc1
Show InChI InChI=1S/C25H29ClN2O3/c1-2-31-23(29)24(19-27,20-7-4-3-5-8-20)13-6-16-28-17-14-25(30,15-18-28)21-9-11-22(26)12-10-21/h3-5,7-12,30H,2,6,13-18H2,1H3
Reactome pathway
n/an/a 7.00E+3n/an/an/an/an/an/a
Berlex Biosciences
Curated by ChEMBL
Assay Description
Inhibition of MIP-1-alpha-induced intracellular calcium mobilization in HEK293 cells expressing human CCR1 receptor
J Med Chem 42: 4680-94 (1999)
BindingDB Entry DOI: 10.7270/Q2125TCC