null
SMILES: COC[C@H](CC1CCCCC1)NCc1ccc(C(=O)N[C@@H](CCSC)C([O-])=O)c(c1)-c1ccccc1C
InChI Key: InChIKey=VOSVCEFFDNSMSR-CUBQBAPOSA-M
Activity Spreadsheet -- Enzyme Inhibition Constant Data from BindingDB
Found 1 hit for monomerid = 50082911
Trg + Lig
Ki
nM
ΔG°
kcal/mole
IC50
nM
Kd
nM
EC50/IC50
nM
koff
s-1
kon
M-1s-1
pHTemp
°C
Protein farnesyltransferase subunit beta/geranylgeranyltransferase type-1 subunit alpha
(Rattus norvegicus-Rattus norvegicus (rat))
BDBM50082911
(2-({5-[(2-Cyclohexyl-1-methoxymethyl-ethylamino)-m...)
Show SMILES COC[C@H](CC1CCCCC1)NCc1ccc(C(=O)N[C@@H](CCSC)C([O-])=O)c(c1)-c1ccccc1C
Show InChI InChI=1S/C30H42N2O4S/c1-21-9-7-8-12-25(21)27-18-23(19-31-24(20-36-2)17-22-10-5-4-6-11-22)13-14-26(27)29(33)32-28(30(34)35)15-16-37-3/h7-9,12-14,18,22,24,28,31H,4-6,10-11,15-17,19-20H2,1-3H3,(H,32,33)(H,34,35)/p-1/t24-,28-/m0/s1
n/an/a 0.660n/an/an/an/an/an/a
Abbott Laboratories
Curated by ChEMBL
Assay Description
In vitro inhibitory activity against Farnesyltransferase (FTase)
J Med Chem 42: 4844-52 (1999)
BindingDB Entry DOI: 10.7270/Q2WW7GWR