null
SMILES: CSCC[C@H](NC(=O)c1ccc(CNCCC2CCCCC2)cc1-c1ccccc1C)C([O-])=O
InChI Key: InChIKey=AITRSUMFMXLCFQ-SANMLTNESA-M
Activity Spreadsheet -- Enzyme Inhibition Constant Data from BindingDB
Found 1 hit for monomerid = 50082918
Trg + Lig
Ki
nM
ΔG°
kcal/mole
IC50
nM
Kd
nM
EC50/IC50
nM
koff
s-1
kon
M-1s-1
pHTemp
°C
Protein farnesyltransferase subunit beta/geranylgeranyltransferase type-1 subunit alpha
(Rattus norvegicus-Rattus norvegicus (rat))
BDBM50082918
(2-({5-[(2-Cyclohexyl-ethylamino)-methyl]-2'-methyl...)
Show SMILES CSCC[C@H](NC(=O)c1ccc(CNCCC2CCCCC2)cc1-c1ccccc1C)C([O-])=O
Show InChI InChI=1S/C28H38N2O3S/c1-20-8-6-7-11-23(20)25-18-22(19-29-16-14-21-9-4-3-5-10-21)12-13-24(25)27(31)30-26(28(32)33)15-17-34-2/h6-8,11-13,18,21,26,29H,3-5,9-10,14-17,19H2,1-2H3,(H,30,31)(H,32,33)/p-1/t26-/m0/s1
n/an/a 0.170n/an/an/an/an/an/a
Abbott Laboratories
Curated by ChEMBL
Assay Description
In vitro inhibitory activity against Farnesyltransferase (FTase)
J Med Chem 42: 4844-52 (1999)
BindingDB Entry DOI: 10.7270/Q2WW7GWR