BDBM50083089 CHEMBL423212::Methyl-thiophen-2-ylmethyl-{1-[3-(5-[1,2,4]triazol-4-yl-1H-indol-3-yl)-propyl]-piperidin-4-yl}-amine
SMILES: CN(Cc1cccs1)C1CCN(CCCc2c[nH]c3ccc(cc23)-n2cnnc2)CC1
InChI Key: InChIKey=BCMVUEDKNGBXFR-UHFFFAOYSA-N
Data: 2 IC50  1 EC50
Activity Spreadsheet -- Enzyme Inhibition Constant Data from BindingDB
Found 3 hits for monomerid = 50083089
Trg + Lig
Ki
nM
ΔG°
kcal/mole
IC50
nM
Kd
nM
EC50/IC50
nM
koff
s-1
kon
M-1s-1
pHTemp
°C
5-hydroxytryptamine receptor 1D
(Homo sapiens (Human))
BDBM50083089
(CHEMBL423212 | Methyl-thiophen-2-ylmethyl-{1-[3-(5...)
Show SMILES CN(Cc1cccs1)C1CCN(CCCc2c[nH]c3ccc(cc23)-n2cnnc2)CC1
Show InChI InChI=1S/C24H30N6S/c1-28(16-22-5-3-13-31-22)20-8-11-29(12-9-20)10-2-4-19-15-25-24-7-6-21(14-23(19)24)30-17-26-27-18-30/h3,5-7,13-15,17-18,20,25H,2,4,8-12,16H2,1H3
Reactome pathway
n/an/an/an/a 3.5n/an/an/an/a
Merck Sharp & Dohme Research Laboratories
Curated by ChEMBL
Assay Description
Agonist-induced [35S]- GTPgammaS binding in CHO cells stably transfected with 5-hydroxytryptamine 1D receptor
J Med Chem 42: 4981-5001 (2000)
BindingDB Entry DOI: 10.7270/Q20P0Z77
5-hydroxytryptamine receptor 1B
(Homo sapiens (Human))
BDBM50083089
(CHEMBL423212 | Methyl-thiophen-2-ylmethyl-{1-[3-(5...)
Show SMILES CN(Cc1cccs1)C1CCN(CCCc2c[nH]c3ccc(cc23)-n2cnnc2)CC1
Show InChI InChI=1S/C24H30N6S/c1-28(16-22-5-3-13-31-22)20-8-11-29(12-9-20)10-2-4-19-15-25-24-7-6-21(14-23(19)24)30-17-26-27-18-30/h3,5-7,13-15,17-18,20,25H,2,4,8-12,16H2,1H3
Reactome pathway
n/an/a 140n/an/an/an/an/an/a
Merck Sharp & Dohme Research Laboratories
Curated by ChEMBL
Assay Description
Displacement of [3H]-5-HT binding to cloned 5-hydroxytryptamine 1B receptor stably expressed in CHO cells
J Med Chem 42: 4981-5001 (2000)
BindingDB Entry DOI: 10.7270/Q20P0Z77
5-hydroxytryptamine receptor 1D
(Homo sapiens (Human))
BDBM50083089
(CHEMBL423212 | Methyl-thiophen-2-ylmethyl-{1-[3-(5...)
Show SMILES CN(Cc1cccs1)C1CCN(CCCc2c[nH]c3ccc(cc23)-n2cnnc2)CC1
Show InChI InChI=1S/C24H30N6S/c1-28(16-22-5-3-13-31-22)20-8-11-29(12-9-20)10-2-4-19-15-25-24-7-6-21(14-23(19)24)30-17-26-27-18-30/h3,5-7,13-15,17-18,20,25H,2,4,8-12,16H2,1H3
Reactome pathway
n/an/a 4.30n/an/an/an/an/an/a
Merck Sharp & Dohme Research Laboratories
Curated by ChEMBL
Assay Description
Displacement of [3H]-5-HT binding to cloned human 5-hydroxytryptamine 1D receptor stably expressed in CHO cells
J Med Chem 42: 4981-5001 (2000)
BindingDB Entry DOI: 10.7270/Q20P0Z77