BDBM50083136 CHEMBL357408::Furan-3-ylmethyl-{1-[3-(5-[1,2,4]triazol-4-yl-1H-indol-3-yl)-propyl]-piperidin-4-yl}-amine
SMILES: C(CN1CCC(CC1)NCc1ccoc1)Cc1c[nH]c2ccc(cc12)-n1cnnc1
InChI Key: InChIKey=MTODVLKVNOCUCW-UHFFFAOYSA-N
Data: 2 IC50  1 EC50
Activity Spreadsheet -- Enzyme Inhibition Constant Data from BindingDB
Found 3 hits for monomerid = 50083136
Trg + Lig
Ki
nM
ΔG°
kcal/mole
IC50
nM
Kd
nM
EC50/IC50
nM
koff
s-1
kon
M-1s-1
pHTemp
°C
5-hydroxytryptamine receptor 1D
(Homo sapiens (Human))
BDBM50083136
(CHEMBL357408 | Furan-3-ylmethyl-{1-[3-(5-[1,2,4]tr...)
Show SMILES C(CN1CCC(CC1)NCc1ccoc1)Cc1c[nH]c2ccc(cc12)-n1cnnc1
Show InChI InChI=1S/C23H28N6O/c1(8-28-9-5-20(6-10-28)24-13-18-7-11-30-15-18)2-19-14-25-23-4-3-21(12-22(19)23)29-16-26-27-17-29/h3-4,7,11-12,14-17,20,24-25H,1-2,5-6,8-10,13H2
Reactome pathway
n/an/an/an/a 7.10n/an/an/an/a
Merck Sharp & Dohme Research Laboratories
Curated by ChEMBL
Assay Description
Agonist-induced [35S]- GTPgammaS binding in CHO cells stably transfected with 5-hydroxytryptamine 1D receptor
J Med Chem 42: 4981-5001 (2000)
BindingDB Entry DOI: 10.7270/Q20P0Z77
5-hydroxytryptamine receptor 1B
(Homo sapiens (Human))
BDBM50083136
(CHEMBL357408 | Furan-3-ylmethyl-{1-[3-(5-[1,2,4]tr...)
Show SMILES C(CN1CCC(CC1)NCc1ccoc1)Cc1c[nH]c2ccc(cc12)-n1cnnc1
Show InChI InChI=1S/C23H28N6O/c1(8-28-9-5-20(6-10-28)24-13-18-7-11-30-15-18)2-19-14-25-23-4-3-21(12-22(19)23)29-16-26-27-17-29/h3-4,7,11-12,14-17,20,24-25H,1-2,5-6,8-10,13H2
Reactome pathway
n/an/a 78n/an/an/an/an/an/a
Merck Sharp & Dohme Research Laboratories
Curated by ChEMBL
Assay Description
Displacement of [3H]-5-HT binding to cloned 5-hydroxytryptamine 1B receptor stably expressed in CHO cells
J Med Chem 42: 4981-5001 (2000)
BindingDB Entry DOI: 10.7270/Q20P0Z77
5-hydroxytryptamine receptor 1D
(Homo sapiens (Human))
BDBM50083136
(CHEMBL357408 | Furan-3-ylmethyl-{1-[3-(5-[1,2,4]tr...)
Show SMILES C(CN1CCC(CC1)NCc1ccoc1)Cc1c[nH]c2ccc(cc12)-n1cnnc1
Show InChI InChI=1S/C23H28N6O/c1(8-28-9-5-20(6-10-28)24-13-18-7-11-30-15-18)2-19-14-25-23-4-3-21(12-22(19)23)29-16-26-27-17-29/h3-4,7,11-12,14-17,20,24-25H,1-2,5-6,8-10,13H2
Reactome pathway
n/an/a 4.5n/an/an/an/an/an/a
Merck Sharp & Dohme Research Laboratories
Curated by ChEMBL
Assay Description
Displacement of [3H]-5-HT binding to cloned human 5-hydroxytryptamine 1D receptor stably expressed in CHO cells
J Med Chem 42: 4981-5001 (2000)
BindingDB Entry DOI: 10.7270/Q20P0Z77