BDBM50083138 (R)-2-Phenyl-2-({1-[3-(5-[1,2,4]triazol-4-yl-1H-indol-3-yl)-propyl]-piperidin-4-ylmethyl}-amino)-ethanol::CHEMBL147979
SMILES: OC[C@H](NCC1CCN(CCCc2c[nH]c3ccc(cc23)-n2cnnc2)CC1)c1ccccc1
InChI Key: InChIKey=YPEQXGWOFIAQCB-MHZLTWQESA-N
Data: 2 IC50
Activity Spreadsheet -- Enzyme Inhibition Constant Data from BindingDB
Found 2 hits for monomerid = 50083138
Trg + Lig
Ki
nM
ΔG°
kcal/mole
IC50
nM
Kd
nM
EC50/IC50
nM
koff
s-1
kon
M-1s-1
pHTemp
°C
5-hydroxytryptamine receptor 1B
(Homo sapiens (Human))
BDBM50083138
((R)-2-Phenyl-2-({1-[3-(5-[1,2,4]triazol-4-yl-1H-in...)
Show SMILES OC[C@H](NCC1CCN(CCCc2c[nH]c3ccc(cc23)-n2cnnc2)CC1)c1ccccc1
Show InChI InChI=1S/C27H34N6O/c34-18-27(22-5-2-1-3-6-22)28-16-21-10-13-32(14-11-21)12-4-7-23-17-29-26-9-8-24(15-25(23)26)33-19-30-31-20-33/h1-3,5-6,8-9,15,17,19-21,27-29,34H,4,7,10-14,16,18H2/t27-/m0/s1
Reactome pathway
n/an/a 79n/an/an/an/an/an/a
Merck Sharp & Dohme Research Laboratories
Curated by ChEMBL
Assay Description
Displacement of [3H]-5-HT binding to cloned 5-hydroxytryptamine 1B receptor stably expressed in CHO cells
J Med Chem 42: 4981-5001 (2000)
BindingDB Entry DOI: 10.7270/Q20P0Z77
5-hydroxytryptamine receptor 1D
(Homo sapiens (Human))
BDBM50083138
((R)-2-Phenyl-2-({1-[3-(5-[1,2,4]triazol-4-yl-1H-in...)
Show SMILES OC[C@H](NCC1CCN(CCCc2c[nH]c3ccc(cc23)-n2cnnc2)CC1)c1ccccc1
Show InChI InChI=1S/C27H34N6O/c34-18-27(22-5-2-1-3-6-22)28-16-21-10-13-32(14-11-21)12-4-7-23-17-29-26-9-8-24(15-25(23)26)33-19-30-31-20-33/h1-3,5-6,8-9,15,17,19-21,27-29,34H,4,7,10-14,16,18H2/t27-/m0/s1
Reactome pathway
n/an/a 5.90n/an/an/an/an/an/a
Merck Sharp & Dohme Research Laboratories
Curated by ChEMBL
Assay Description
Displacement of [3H]-5-HT binding to cloned human 5-hydroxytryptamine 1D receptor stably expressed in CHO cells
J Med Chem 42: 4981-5001 (2000)
BindingDB Entry DOI: 10.7270/Q20P0Z77