BDBM50083147 CHEMBL145982::N-Methyl-N-{1-[3-(5-[1,2,4]triazol-4-yl-1H-indol-3-yl)-propyl]-piperidin-4-ylmethyl}-benzenesulfonamide
SMILES: CN(CC1CCN(CCCc2c[nH]c3ccc(cc23)-n2cnnc2)CC1)S(=O)(=O)c1ccccc1
InChI Key: InChIKey=VKHZOVXQNVSNRR-UHFFFAOYSA-N
Data: 2 IC50
Activity Spreadsheet -- Enzyme Inhibition Constant Data from BindingDB
Found 2 hits for monomerid = 50083147
Trg + Lig
Ki
nM
ΔG°
kcal/mole
IC50
nM
Kd
nM
EC50/IC50
nM
koff
s-1
kon
M-1s-1
pHTemp
°C
5-hydroxytryptamine receptor 1D
(Homo sapiens (Human))
BDBM50083147
(CHEMBL145982 | N-Methyl-N-{1-[3-(5-[1,2,4]triazol-...)
Show SMILES CN(CC1CCN(CCCc2c[nH]c3ccc(cc23)-n2cnnc2)CC1)S(=O)(=O)c1ccccc1
Show InChI InChI=1S/C26H32N6O2S/c1-30(35(33,34)24-7-3-2-4-8-24)18-21-11-14-31(15-12-21)13-5-6-22-17-27-26-10-9-23(16-25(22)26)32-19-28-29-20-32/h2-4,7-10,16-17,19-21,27H,5-6,11-15,18H2,1H3
Reactome pathway
n/an/a 1.60n/an/an/an/an/an/a
Merck Sharp & Dohme Research Laboratories
Curated by ChEMBL
Assay Description
Displacement of [3H]-5-HT binding to cloned human 5-hydroxytryptamine 1D receptor stably expressed in CHO cells
J Med Chem 42: 4981-5001 (2000)
BindingDB Entry DOI: 10.7270/Q20P0Z77
5-hydroxytryptamine receptor 1B
(Homo sapiens (Human))
BDBM50083147
(CHEMBL145982 | N-Methyl-N-{1-[3-(5-[1,2,4]triazol-...)
Show SMILES CN(CC1CCN(CCCc2c[nH]c3ccc(cc23)-n2cnnc2)CC1)S(=O)(=O)c1ccccc1
Show InChI InChI=1S/C26H32N6O2S/c1-30(35(33,34)24-7-3-2-4-8-24)18-21-11-14-31(15-12-21)13-5-6-22-17-27-26-10-9-23(16-25(22)26)32-19-28-29-20-32/h2-4,7-10,16-17,19-21,27H,5-6,11-15,18H2,1H3
Reactome pathway
n/an/a 18n/an/an/an/an/an/a
Merck Sharp & Dohme Research Laboratories
Curated by ChEMBL
Assay Description
Displacement of [3H]-5-HT binding to cloned 5-hydroxytryptamine 1B receptor stably expressed in CHO cells
J Med Chem 42: 4981-5001 (2000)
BindingDB Entry DOI: 10.7270/Q20P0Z77