BDBM50083718 CHEMBL3423202
SMILES: NC(=O)[C@@H]1O[C@@H]1C(=O)Nc1ccc(Oc2ccc(N)cc2)cc1
InChI Key: InChIKey=KFASJCJZMXBMDH-KGLIPLIRSA-N
Data: 2 IC50
Activity Spreadsheet -- Enzyme Inhibition Constant Data from BindingDB
Found 2 hits for monomerid = 50083718
Trg + Lig
Ki
nM
ΔG°
kcal/mole
IC50
nM
Kd
nM
EC50/IC50
nM
koff
s-1
kon
M-1s-1
pHTemp
°C
Protein-glutamine gamma-glutamyltransferase 2
(Homo sapiens (Human))
BDBM50083718
(CHEMBL3423202)
Show SMILES NC(=O)[C@@H]1O[C@@H]1C(=O)Nc1ccc(Oc2ccc(N)cc2)cc1 |r|
Show InChI InChI=1S/C16H15N3O4/c17-9-1-5-11(6-2-9)22-12-7-3-10(4-8-12)19-16(21)14-13(23-14)15(18)20/h1-8,13-14H,17H2,(H2,18,20)(H,19,21)/t13-,14+/m1/s1
n/an/a 48n/an/an/an/an/an/a
University of Leeds
Curated by ChEMBL
Assay Description
Inhibition of transglutaminase 2 (unknown origin)
Eur J Med Chem 98: 49-53 (2015)
Article DOI: 10.1016/j.ejmech.2015.05.019
BindingDB Entry DOI: 10.7270/Q261121G
Coagulation factor XIII A chain
(Homo sapiens (Human))
BDBM50083718
(CHEMBL3423202)
Show SMILES NC(=O)[C@@H]1O[C@@H]1C(=O)Nc1ccc(Oc2ccc(N)cc2)cc1 |r|
Show InChI InChI=1S/C16H15N3O4/c17-9-1-5-11(6-2-9)22-12-7-3-10(4-8-12)19-16(21)14-13(23-14)15(18)20/h1-8,13-14H,17H2,(H2,18,20)(H,19,21)/t13-,14+/m1/s1
Reactome pathway
n/an/a 86n/an/an/an/an/an/a
University of Leeds
Curated by ChEMBL
Assay Description
Inhibition of thrombin-activated F13-A (unknown origin) in plasma assessed as inhibition of fibrin clot formation after 7 mins by biotin incorporatio...
Eur J Med Chem 98: 49-53 (2015)
Article DOI: 10.1016/j.ejmech.2015.05.019
BindingDB Entry DOI: 10.7270/Q261121G