BDBM50083723 CHEMBL3423197
SMILES: NC(=O)[C@@H]1O[C@@H]1C(=O)Nc1ccc(Br)cc1
InChI Key: InChIKey=QXPGBZSOGVCSDE-SFYZADRCSA-N
Data: 2 IC50
Activity Spreadsheet -- Enzyme Inhibition Constant Data from BindingDB
Found 2 hits for monomerid = 50083723
Trg + Lig
Ki
nM
ΔG°
kcal/mole
IC50
nM
Kd
nM
EC50/IC50
nM
koff
s-1
kon
M-1s-1
pHTemp
°C
Protein-glutamine gamma-glutamyltransferase 2
(Homo sapiens (Human))
BDBM50083723
(CHEMBL3423197)
Show SMILES NC(=O)[C@@H]1O[C@@H]1C(=O)Nc1ccc(Br)cc1 |r|
Show InChI InChI=1S/C10H9BrN2O3/c11-5-1-3-6(4-2-5)13-10(15)8-7(16-8)9(12)14/h1-4,7-8H,(H2,12,14)(H,13,15)/t7-,8+/m1/s1
n/an/a 57n/an/an/an/an/an/a
University of Leeds
Curated by ChEMBL
Assay Description
Inhibition of transglutaminase 2 (unknown origin)
Eur J Med Chem 98: 49-53 (2015)
Article DOI: 10.1016/j.ejmech.2015.05.019
BindingDB Entry DOI: 10.7270/Q261121G
Coagulation factor XIII A chain
(Homo sapiens (Human))
BDBM50083723
(CHEMBL3423197)
Show SMILES NC(=O)[C@@H]1O[C@@H]1C(=O)Nc1ccc(Br)cc1 |r|
Show InChI InChI=1S/C10H9BrN2O3/c11-5-1-3-6(4-2-5)13-10(15)8-7(16-8)9(12)14/h1-4,7-8H,(H2,12,14)(H,13,15)/t7-,8+/m1/s1
Reactome pathway
n/an/a 130n/an/an/an/an/an/a
University of Leeds
Curated by ChEMBL
Assay Description
Inhibition of thrombin-activated F13-A (unknown origin) in plasma assessed as inhibition of fibrin clot formation after 7 mins by biotin incorporatio...
Eur J Med Chem 98: 49-53 (2015)
Article DOI: 10.1016/j.ejmech.2015.05.019
BindingDB Entry DOI: 10.7270/Q261121G