BDBM50083860 6,6,9-Trimethyl-3-oct-3-ynyl-6a,7,10,10a-tetrahydro-6H-benzo[c]chromen-1-ol::CHEMBL161073
SMILES: CCCCC#CCCc1cc(O)c2C3CC(C)=CCC3C(C)(C)Oc2c1
InChI Key: InChIKey=DVCBEVODQHDPAR-UHFFFAOYSA-N
Data: 1 Kd
Activity Spreadsheet -- Enzyme Inhibition Constant Data from BindingDB
Found 1 hit for monomerid = 50083860
Trg + Lig
Ki
nM
ΔG°
kcal/mole
IC50
nM
Kd
nM
EC50/IC50
nM
koff
s-1
kon
M-1s-1
pHTemp
°C
Cannabinoid receptor 1
(Homo sapiens (Human))
BDBM50083860
(6,6,9-Trimethyl-3-oct-3-ynyl-6a,7,10,10a-tetrahydr...)
Show SMILES CCCCC#CCCc1cc(O)c2C3CC(C)=CCC3C(C)(C)Oc2c1 |c:16|
Show InChI InChI=1S/C24H32O2/c1-5-6-7-8-9-10-11-18-15-21(25)23-19-14-17(2)12-13-20(19)24(3,4)26-22(23)16-18/h12,15-16,19-20,25H,5-7,10-11,13-14H2,1-4H3
NCI pathway
Reactome pathway
n/an/an/a 9n/an/an/an/an/a
Research Triangle Institute
Curated by ChEMBL
Assay Description
Binding affinity against Cannabinoid receptor 1.
J Med Chem 43: 59-70 (2000)
BindingDB Entry DOI: 10.7270/Q2WQ0305