null
SMILES: CSC(NCCc1ccccc1Cl)=Nc1ccc(Br)cn1
InChI Key: InChIKey=IXROSZCGCHGTIA-UHFFFAOYSA-N
Activity Spreadsheet -- Enzyme Inhibition Constant Data from BindingDB
Found 1 hit for monomerid = 50084095
Trg + Lig
Ki
nM
ΔG°
kcal/mole
IC50
nM
Kd
nM
EC50/IC50
nM
koff
s-1
kon
M-1s-1
pHTemp
°C
Reverse transcriptase/RNaseH
(Human immunodeficiency virus 1)
BDBM50084095
(1-(5-Bromo-pyridin-2-yl)-3-[2-(2-chloro-phenyl)-et...)
Show SMILES CSC(NCCc1ccccc1Cl)=Nc1ccc(Br)cn1 |w:13.14|
Show InChI InChI=1S/C15H15BrClN3S/c1-21-15(20-14-7-6-12(16)10-19-14)18-9-8-11-4-2-3-5-13(11)17/h2-7,10H,8-9H2,1H3,(H,18,19,20)
n/an/a>1.00E+5n/an/an/an/an/an/a
Institute
Curated by ChEMBL
Assay Description
Inhibition of recombinant HIV-1 reverse transcriptase
Bioorg Med Chem Lett 10: 87-90 (2000)
BindingDB Entry DOI: 10.7270/Q27080NB