BDBM50084156 CHEMBL3425954
SMILES: CCC(=O)Nc1cncc(c1)-c1cccc2[nH]ccc12
InChI Key: InChIKey=RENMRMRFFSOHQW-UHFFFAOYSA-N
Data: 1 IC50  1 Kd
Activity Spreadsheet -- Enzyme Inhibition Constant Data from BindingDB
Found 2 hits for monomerid = 50084156
Trg + Lig
Ki
nM
ΔG°
kcal/mole
IC50
nM
Kd
nM
EC50/IC50
nM
koff
s-1
kon
M-1s-1
pHTemp
°C
Prostaglandin D Synthase
(Homo sapiens (Human))
BDBM50084156
(CHEMBL3425954)
Show SMILES CCC(=O)Nc1cncc(c1)-c1cccc2[nH]ccc12
Show InChI InChI=1S/C16H15N3O/c1-2-16(20)19-12-8-11(9-17-10-12)13-4-3-5-15-14(13)6-7-18-15/h3-10,18H,2H2,1H3,(H,19,20)
Reactome pathway
n/an/a 32n/an/an/an/an/an/a
AstraZeneca
Curated by ChEMBL
Assay Description
Inhibition human HPGDS expressed in Escherichia coli assessed as reduction in GST enzymatic activity using MCBL and glutathione incubated for 30 mins...
Bioorg Med Chem Lett 25: 2496-500 (2015)
Article DOI: 10.1016/j.bmcl.2015.04.065
BindingDB Entry DOI: 10.7270/Q2J9683M
Prostaglandin D Synthase
(Homo sapiens (Human))
BDBM50084156
(CHEMBL3425954)
Show SMILES CCC(=O)Nc1cncc(c1)-c1cccc2[nH]ccc12
Show InChI InChI=1S/C16H15N3O/c1-2-16(20)19-12-8-11(9-17-10-12)13-4-3-5-15-14(13)6-7-18-15/h3-10,18H,2H2,1H3,(H,19,20)
Reactome pathway
n/an/an/a 60n/an/an/an/an/a
AstraZeneca
Curated by ChEMBL
Assay Description
Binding affinity to human HPGDS expressed in Escherichia coli using 1-phenylpyrazole-4-carboxylic acid/6-(3-fluorophenyl)pyridine-3-carboxamide as re...
Bioorg Med Chem Lett 25: 2496-500 (2015)
Article DOI: 10.1016/j.bmcl.2015.04.065
BindingDB Entry DOI: 10.7270/Q2J9683M