BDBM50084232 2-(diethylamino)-5-isopropyl-4H-thieno[2,3-d][1,3]oxazin-4-one::2-Diethylamino-5-isopropyl-thieno[2,3-d][1,3]oxazin-4-one::CHEMBL347069
SMILES: CCN(CC)c1nc2scc(C(C)C)c2c(=O)o1
InChI Key: InChIKey=RYCIORVNRWSZRJ-UHFFFAOYSA-N
Data: 2 KI  1 IC50
Activity Spreadsheet -- Enzyme Inhibition Constant Data from BindingDB
Found 3 hits for monomerid = 50084232
Trg + Lig
Ki
nM
ΔG°
kcal/mole
IC50
nM
Kd
nM
EC50/IC50
nM
koff
s-1
kon
M-1s-1
pHTemp
°C
Leukocyte elastase
(Homo sapiens (Human))
BDBM50084232
(2-(diethylamino)-5-isopropyl-4H-thieno[2,3-d][1,3]...)
Show SMILES CCN(CC)c1nc2scc(C(C)C)c2c(=O)o1
Show InChI InChI=1S/C13H18N2O2S/c1-5-15(6-2)13-14-11-10(12(16)17-13)9(7-18-11)8(3)4/h7-8H,5-6H2,1-4H3
Reactome pathway
13n/an/an/an/an/an/an/an/a
University of Leipzig
Curated by ChEMBL
Assay Description
Inhibitory activity of the compound was tested against human leukocyte elastase
J Med Chem 42: 5437-47 (2000)
BindingDB Entry DOI: 10.7270/Q2K936RG
Cholesterol esterase
(Bos taurus)
BDBM50084232
(2-(diethylamino)-5-isopropyl-4H-thieno[2,3-d][1,3]...)
Show SMILES CCN(CC)c1nc2scc(C(C)C)c2c(=O)o1
Show InChI InChI=1S/C13H18N2O2S/c1-5-15(6-2)13-14-11-10(12(16)17-13)9(7-18-11)8(3)4/h7-8H,5-6H2,1-4H3
6.40E+3n/an/an/an/an/an/an/an/a
University of Bonn
Curated by ChEMBL
Assay Description
Inhibitory activity against bovine pancreatic CEase in presence of pNPB chromogenic substrate by spectrophotometry
J Med Chem 48: 8270-88 (2005)
Article DOI: 10.1021/jm0508639
BindingDB Entry DOI: 10.7270/Q2GQ6XB4
Acetylcholinesterase
(Electrophorus electricus (Electric eel))
BDBM50084232
(2-(diethylamino)-5-isopropyl-4H-thieno[2,3-d][1,3]...)
Show SMILES CCN(CC)c1nc2scc(C(C)C)c2c(=O)o1
Show InChI InChI=1S/C13H18N2O2S/c1-5-15(6-2)13-14-11-10(12(16)17-13)9(7-18-11)8(3)4/h7-8H,5-6H2,1-4H3
n/an/a>5.00E+4n/an/an/an/an/an/a
University of Bonn
Curated by ChEMBL
Assay Description
Inhibitory activity AChE from Electrophorus electricus using ATCh substrate and DTNB by spectrophotometry
J Med Chem 48: 8270-88 (2005)
Article DOI: 10.1021/jm0508639
BindingDB Entry DOI: 10.7270/Q2GQ6XB4