BDBM50084687 3-Acetylamino-N-[2-carboxy-1-(1-{1-[2-(1-carboxy-2-mercapto-ethylcarbamoyl)-pyrrolidine-1-carbonyl]-2-methyl-propylcarbamoyl}-2-methyl-butylcarbamoyl)-ethyl]-succinamic acid(NS5A-NS5B)::CHEMBL116044
SMILES: CCC(C)[C@H](NC(=O)[C@H](CC(O)=O)NC(=O)[C@H](CC(O)=O)NC(C)=O)C(=O)N[C@@H](C(C)C)C(=O)N1CCC[C@H]1C(=O)N[C@@H](CS)C(O)=O
InChI Key: InChIKey=JXDNUMOTWHZSCB-PMCYHXDBSA-N
Data: 1 IC50
Activity Spreadsheet -- Enzyme Inhibition Constant Data from BindingDB
Found 1 hit for monomerid = 50084687
Trg + Lig
Ki
nM
ΔG°
kcal/mole
IC50
nM
Kd
nM
EC50/IC50
nM
koff
s-1
kon
M-1s-1
pHTemp
°C
Human rhinovirus A protease
(Human rhinovirus B)
BDBM50084687
(3-Acetylamino-N-[2-carboxy-1-(1-{1-[2-(1-carboxy-2...)
Show SMILES CCC(C)[C@H](NC(=O)[C@H](CC(O)=O)NC(=O)[C@H](CC(O)=O)NC(C)=O)C(=O)N[C@@H](C(C)C)C(=O)N1CCC[C@H]1C(=O)N[C@@H](CS)C(O)=O
Show InChI InChI=1S/C29H46N6O12S/c1-6-14(4)23(34-25(42)17(11-21(39)40)31-24(41)16(10-20(37)38)30-15(5)36)27(44)33-22(13(2)3)28(45)35-9-7-8-19(35)26(43)32-18(12-48)29(46)47/h13-14,16-19,22-23,48H,6-12H2,1-5H3,(H,30,36)(H,31,41)(H,32,43)(H,33,44)(H,34,42)(H,37,38)(H,39,40)(H,46,47)/t14?,16-,17-,18-,19-,22-,23-/m0/s1
n/an/a 2.80E+4n/an/an/an/an/an/a
University of Queensland
Curated by ChEMBL
Assay Description
Inhibitory concentration against Protease
J Med Chem 43: 305-41 (2000)
Checked by Author
BindingDB Entry DOI: 10.7270/Q2JD4XH4