BDBM50084887 CHEMBL3427346
SMILES: C1CCC(\C=N\N2CCN(CC2)c2ccccc2)=CC1
InChI Key: InChIKey=ZOGNSZULDMRVAE-OBGWFSINSA-N
Data: 1 IC50
Activity Spreadsheet -- Enzyme Inhibition Constant Data from BindingDB
Found 1 hit for monomerid = 50084887
Trg + Lig
Ki
nM
ΔG°
kcal/mole
IC50
nM
Kd
nM
EC50/IC50
nM
koff
s-1
kon
M-1s-1
pHTemp
°C
Patatin-like phospholipase domain-containing protein 2
(Mus musculus)
BDBM50084887
(CHEMBL3427346)
Show SMILES C1CCC(\C=N\N2CCN(CC2)c2ccccc2)=CC1 |c:19|
Show InChI InChI=1S/C17H23N3/c1-3-7-16(8-4-1)15-18-20-13-11-19(12-14-20)17-9-5-2-6-10-17/h2,5-7,9-10,15H,1,3-4,8,11-14H2/b18-15+
n/an/a 1.30E+5n/an/an/an/an/an/a
Graz University of Technology
Curated by ChEMBL
Assay Description
Inhibition of mouse recombinant ATGL expressed in African green monkey COS7 cells assessed as reduction in triglyceride hydrolase activity using radi...
Bioorg Med Chem 23: 2904-16 (2015)
Article DOI: 10.1016/j.bmc.2015.02.051
BindingDB Entry DOI: 10.7270/Q2086710