null
SMILES: Cc1ncc(CCP(O)(O)=O)c(CO)c1O
InChI Key: InChIKey=JWJVWJVYBWLXDN-UHFFFAOYSA-N
PDB links: 1 PDB ID matches this monomer.
Activity Spreadsheet -- Enzyme Inhibition Constant Data from BindingDB
Found 1 hit for monomerid = 50084934
Trg + Lig
Ki
nM
ΔG°
kcal/mole
IC50
nM
Kd
nM
EC50/IC50
nM
koff
s-1
kon
M-1s-1
pHTemp
°C
Chronophin
(Mus musculus)
BDBM50084934
(CHEMBL3427370)
Show SMILES Cc1ncc(CCP(O)(O)=O)c(CO)c1O
Show InChI InChI=1S/C9H14NO5P/c1-6-9(12)8(5-11)7(4-10-6)2-3-16(13,14)15/h4,11-12H,2-3,5H2,1H3,(H2,13,14,15)
n/an/a 1.30E+6n/an/an/an/an/an/a
University of W£rzburg
Curated by ChEMBL
Assay Description
Inhibition of recombinant mouse brain PDXP expressed in Escherichia coli BL21 (DE3) cells assessed as pyridoxal 5' phosphate dephosphorylation preinc...
Bioorg Med Chem 23: 2819-27 (2015)
Article DOI: 10.1016/j.bmc.2015.02.049
BindingDB Entry DOI: 10.7270/Q2VH5QKR
3D
3D Structure (crystal)