null
SMILES: [#6]-[#8]-c1cc(ccc1-[#8])-[#6]-1-[#8]-c2cc(ccc2-[#8]-[#6]-1-[#6]-[#8])-c1oc2cc(-[#8])c(-[#6]\[#6]=[#6](/[#6])-[#6]-[#6]\[#6]=[#6](\[#6])-[#6])c(-[#8])c2c(=O)c1-[#8]
InChI Key: InChIKey=DOIVJLSCACGVGR-UFWORHAWSA-N
Activity Spreadsheet -- Enzyme Inhibition Constant Data from BindingDB
Found 1 hit for monomerid = 50084975
Trg + Lig
Ki
nM
ΔG°
kcal/mole
IC50
nM
Kd
nM
EC50/IC50
nM
koff
s-1
kon
M-1s-1
pHTemp
°C
ATP-dependent translocase ABCB1
(Mus musculus (Mouse))
BDBM50084975
(6-((E)-3,7-Dimethyl-octa-2,6-dienyl)-3,5,7-trihydr...)
Show SMILES [#6]-[#8]-c1cc(ccc1-[#8])-[#6]-1-[#8]-c2cc(ccc2-[#8]-[#6]-1-[#6]-[#8])-c1oc2cc(-[#8])c(-[#6]\[#6]=[#6](/[#6])-[#6]-[#6]\[#6]=[#6](\[#6])-[#6])c(-[#8])c2c(=O)c1-[#8]
Show InChI InChI=1S/C35H36O10/c1-18(2)6-5-7-19(3)8-11-22-24(38)16-28-30(31(22)39)32(40)33(41)35(45-28)21-10-13-25-27(15-21)44-34(29(17-36)43-25)20-9-12-23(37)26(14-20)42-4/h6,8-10,12-16,29,34,36-39,41H,5,7,11,17H2,1-4H3/b19-8+
n/an/an/a 180n/an/an/an/an/a
Universit£ Claude Bernard-Lyon 1
Curated by ChEMBL
Assay Description
Compound was tested for the binding affinity towards recombinant NBD2 C-terminal cytotoxic nucleotide-binding domain of mouse P-Glycoprotein
Bioorg Med Chem Lett 10: 157-60 (2000)
BindingDB Entry DOI: 10.7270/Q2DR2W1W