BDBM50085611 CHEMBL127680::{6-[(6-Carbamimidoyl-pyridine-3-carbonyl)-amino]-1-oxo-1,2,3,4-tetrahydro-naphthalen-2-yl}-acetic acid
SMILES: NC(=N)c1ccc(cn1)C(=O)Nc1ccc2C(=O)C(CC(O)=O)CCc2c1
InChI Key: InChIKey=FHHKNJSJONAARK-UHFFFAOYSA-N
Data: 1 IC50
Activity Spreadsheet -- Enzyme Inhibition Constant Data from BindingDB
Found 1 hit for monomerid = 50085611
Trg + Lig
Ki
nM
ΔG°
kcal/mole
IC50
nM
Kd
nM
EC50/IC50
nM
koff
s-1
kon
M-1s-1
pHTemp
°C
Integrin alpha-IIb/beta-3
(Homo sapiens (Human))
BDBM50085611
(CHEMBL127680 | {6-[(6-Carbamimidoyl-pyridine-3-car...)
Show SMILES NC(=N)c1ccc(cn1)C(=O)Nc1ccc2C(=O)C(CC(O)=O)CCc2c1
Show InChI InChI=1S/C19H18N4O4/c20-18(21)15-6-3-12(9-22-15)19(27)23-13-4-5-14-10(7-13)1-2-11(17(14)26)8-16(24)25/h3-7,9,11H,1-2,8H2,(H3,20,21)(H,23,27)(H,24,25)
n/an/a 9n/an/an/an/an/an/a
Eli Lilly and Company
Curated by ChEMBL
Assay Description
Inhibition of fibrinogen binding to purified human GPIIb-IIIa in ELISA
Bioorg Med Chem Lett 10: 385-9 (2000)
BindingDB Entry DOI: 10.7270/Q2FB5252