BDBM50086123 CHEMBL3425694
SMILES: CN(C)CCOc1nc(\C=C\c2ccc(Cl)cc2)nc2cc3ccccc3cc12
InChI Key: InChIKey=ACMHWXUNXHLIDZ-FMIVXFBMSA-N
Data: 1 IC50
Activity Spreadsheet -- Enzyme Inhibition Constant Data from BindingDB
Found 1 hit for monomerid = 50086123
Trg + Lig
Ki
nM
ΔG°
kcal/mole
IC50
nM
Kd
nM
EC50/IC50
nM
koff
s-1
kon
M-1s-1
pHTemp
°C
Cell division protein FtsZ
(Escherichia coli)
BDBM50086123
(CHEMBL3425694)
Show SMILES CN(C)CCOc1nc(\C=C\c2ccc(Cl)cc2)nc2cc3ccccc3cc12
Show InChI InChI=1S/C24H22ClN3O/c1-28(2)13-14-29-24-21-15-18-5-3-4-6-19(18)16-22(21)26-23(27-24)12-9-17-7-10-20(25)11-8-17/h3-12,15-16H,13-14H2,1-2H3/b12-9+
n/an/a 2.60E+4n/an/an/an/an/an/a
University of California at Davis
Curated by ChEMBL
Assay Description
Inhibition of Escherichia coli FtsZ GTPase activity after 5 mins by enzyme-coupled inhibition assay
ACS Med Chem Lett 6: 308-12 (2015)
Article DOI: 10.1021/ml500497s
BindingDB Entry DOI: 10.7270/Q2PV6N4C