BDBM50086225 CHEMBL3425729
SMILES: Cc1cc(C)cc(c1)-n1cc(O)c(=O)cc1CO
InChI Key: InChIKey=YCBOAYQSNVSSHY-UHFFFAOYSA-N
Data: 1 IC50
Activity Spreadsheet -- Enzyme Inhibition Constant Data from BindingDB
Found 1 hit for monomerid = 50086225
Trg + Lig
Ki
nM
ΔG°
kcal/mole
IC50
nM
Kd
nM
EC50/IC50
nM
koff
s-1
kon
M-1s-1
pHTemp
°C
Catechol O-methyltransferase (MB-COMT)
(Homo sapiens (Human))
BDBM50086225
(CHEMBL3425729)
Show SMILES Cc1cc(C)cc(c1)-n1cc(O)c(=O)cc1CO
Show InChI InChI=1S/C14H15NO3/c1-9-3-10(2)5-11(4-9)15-7-14(18)13(17)6-12(15)8-16/h3-7,16,18H,8H2,1-2H3
n/an/a 680n/an/an/an/an/an/a
Merck Research Laboratories
Curated by ChEMBL
Assay Description
Inhibition of C-terminal His6-tagged recombinant human membrane bound COMT expressed in Bacmid infected Sf-9 insect cells using dopamine/SAM as subst...
ACS Med Chem Lett 6: 318-23 (2015)
Article DOI: 10.1021/ml500502d
BindingDB Entry DOI: 10.7270/Q2K35WDZ