BDBM50086263 CHEMBL3425860
SMILES: C1CN(CCO1)c1snc2cc(cnc12)-c1ccoc1
InChI Key: InChIKey=LQLJTDVAWNAYLE-UHFFFAOYSA-N
Data: 1 Kd
Activity Spreadsheet -- Enzyme Inhibition Constant Data from BindingDB
Found 1 hit for monomerid = 50086263
Trg + Lig
Ki
nM
ΔG°
kcal/mole
IC50
nM
Kd
nM
EC50/IC50
nM
koff
s-1
kon
M-1s-1
pHTemp
°C
Serine/threonine-protein kinase GAK
(Homo sapiens (Human))
BDBM50086263
(CHEMBL3425860)
Show SMILES C1CN(CCO1)c1snc2cc(cnc12)-c1ccoc1
Show InChI InChI=1S/C14H13N3O2S/c1-4-19-9-10(1)11-7-12-13(15-8-11)14(20-16-12)17-2-5-18-6-3-17/h1,4,7-9H,2-3,5-6H2
Reactome pathway
n/an/an/a 200n/an/an/an/an/a
KU Leuven
Curated by ChEMBL
Assay Description
Binding affinity to human GAK fused to T7 bacteriophage expressed in Escherichia coli BL21 after 1 hr by qPCR analysis
J Med Chem 58: 3393-410 (2015)
Article DOI: 10.1021/jm501759m
BindingDB Entry DOI: 10.7270/Q2XD13D4