BDBM50086276 CHEMBL3425875
SMILES: COc1ccc(cc1OC)-c1cnc2c(snc2c1)N1CCSCC1
InChI Key: InChIKey=GUJGKJXOGPAKDT-UHFFFAOYSA-N
Data: 1 Kd
Activity Spreadsheet -- Enzyme Inhibition Constant Data from BindingDB
Found 1 hit for monomerid = 50086276
Trg + Lig
Ki
nM
ΔG°
kcal/mole
IC50
nM
Kd
nM
EC50/IC50
nM
koff
s-1
kon
M-1s-1
pHTemp
°C
Serine/threonine-protein kinase GAK
(Homo sapiens (Human))
BDBM50086276
(CHEMBL3425875)
Show SMILES COc1ccc(cc1OC)-c1cnc2c(snc2c1)N1CCSCC1
Show InChI InChI=1S/C18H19N3O2S2/c1-22-15-4-3-12(10-16(15)23-2)13-9-14-17(19-11-13)18(25-20-14)21-5-7-24-8-6-21/h3-4,9-11H,5-8H2,1-2H3
Reactome pathway
n/an/an/a 230n/an/an/an/an/a
KU Leuven
Curated by ChEMBL
Assay Description
Binding affinity to human GAK fused to T7 bacteriophage expressed in Escherichia coli BL21 after 1 hr by qPCR analysis
J Med Chem 58: 3393-410 (2015)
Article DOI: 10.1021/jm501759m
BindingDB Entry DOI: 10.7270/Q2XD13D4