BDBM50086448 CHEMBL3426226::US10266537, Compound 6
SMILES: CN1CCN(Cc2ccc(NC(=O)c3ccc(C)c(c3)C#Cc3nn(C4CCC4)c4ncnc(N)c34)cc2C(F)(F)F)CC1
InChI Key: InChIKey=CWEOEBZJBKISJK-UHFFFAOYSA-N
Data: 2 IC50
Activity Spreadsheet -- Enzyme Inhibition Constant Data from BindingDB
Found 2 hits for monomerid = 50086448
Trg + Lig
Ki
nM
ΔG°
kcal/mole
IC50
nM
Kd
nM
EC50/IC50
nM
koff
s-1
kon
M-1s-1
pHTemp
°C
Proto-oncogene tyrosine-protein kinase Src (aa 1-530)
(Homo sapiens (Human))
BDBM50086448
(CHEMBL3426226 | US10266537, Compound 6)
Show SMILES CN1CCN(Cc2ccc(NC(=O)c3ccc(C)c(c3)C#Cc3nn(C4CCC4)c4ncnc(N)c34)cc2C(F)(F)F)CC1
Show InChI InChI=1S/C32H33F3N8O/c1-20-6-7-22(16-21(20)9-11-27-28-29(36)37-19-38-30(28)43(40-27)25-4-3-5-25)31(44)39-24-10-8-23(26(17-24)32(33,34)35)18-42-14-12-41(2)13-15-42/h6-8,10,16-17,19,25H,3-5,12-15,18H2,1-2H3,(H,39,44)(H2,36,37,38)
US Patent
n/an/a 9n/an/an/an/an/an/a
Kalypsys, Inc.
Assay Description
The aim of this experiment is to detect the inhibitory activity of the compounds of the present invention against in vitro protein kinases using isot...
Bioorg Med Chem Lett 17: 3562-9 (2007)
BindingDB Entry DOI: 10.7270/Q21C2065
Proto-oncogene tyrosine-protein kinase Src
(Homo sapiens (Human))
BDBM50086448
(CHEMBL3426226 | US10266537, Compound 6)
Show SMILES CN1CCN(Cc2ccc(NC(=O)c3ccc(C)c(c3)C#Cc3nn(C4CCC4)c4ncnc(N)c34)cc2C(F)(F)F)CC1
Show InChI InChI=1S/C32H33F3N8O/c1-20-6-7-22(16-21(20)9-11-27-28-29(36)37-19-38-30(28)43(40-27)25-4-3-5-25)31(44)39-24-10-8-23(26(17-24)32(33,34)35)18-42-14-12-41(2)13-15-42/h6-8,10,16-17,19,25H,3-5,12-15,18H2,1-2H3,(H,39,44)(H2,36,37,38)
n/an/a 9n/an/an/an/an/an/a
Sichuan University
Curated by ChEMBL
Assay Description
Inhibition of human Src
J Med Chem 58: 3957-74 (2015)
Article DOI: 10.1021/acs.jmedchem.5b00270
BindingDB Entry DOI: 10.7270/Q2J38V91