BDBM50086458 CHEMBL3426240::US10266537, Compound 25
SMILES: CCn1nc(C#Cc2cc(ccc2O)C(=O)Nc2ccc(CN3CCN(C)CC3)c(c2)C(F)(F)F)c2c(N)ncnc12
InChI Key: InChIKey=FHELRYVFGKYWGY-UHFFFAOYSA-N
Data: 2 IC50
Activity Spreadsheet -- Enzyme Inhibition Constant Data from BindingDB
Found 2 hits for monomerid = 50086458
Trg + Lig
Ki
nM
ΔG°
kcal/mole
IC50
nM
Kd
nM
EC50/IC50
nM
koff
s-1
kon
M-1s-1
pHTemp
°C
Proto-oncogene tyrosine-protein kinase Src (aa 1-530)
(Homo sapiens (Human))
BDBM50086458
(CHEMBL3426240 | US10266537, Compound 25)
Show SMILES CCn1nc(C#Cc2cc(ccc2O)C(=O)Nc2ccc(CN3CCN(C)CC3)c(c2)C(F)(F)F)c2c(N)ncnc12
Show InChI InChI=1S/C29H29F3N8O2/c1-3-40-27-25(26(33)34-17-35-27)23(37-40)8-5-18-14-19(6-9-24(18)41)28(42)36-21-7-4-20(22(15-21)29(30,31)32)16-39-12-10-38(2)11-13-39/h4,6-7,9,14-15,17,41H,3,10-13,16H2,1-2H3,(H,36,42)(H2,33,34,35)
US Patent
n/an/a 3.19E+3n/an/an/an/an/an/a
Kalypsys, Inc.
Assay Description
The aim of this experiment is to detect the inhibitory activity of the compounds of the present invention against in vitro protein kinases using isot...
Bioorg Med Chem Lett 17: 3562-9 (2007)
BindingDB Entry DOI: 10.7270/Q21C2065
Proto-oncogene tyrosine-protein kinase Src
(Homo sapiens (Human))
BDBM50086458
(CHEMBL3426240 | US10266537, Compound 25)
Show SMILES CCn1nc(C#Cc2cc(ccc2O)C(=O)Nc2ccc(CN3CCN(C)CC3)c(c2)C(F)(F)F)c2c(N)ncnc12
Show InChI InChI=1S/C29H29F3N8O2/c1-3-40-27-25(26(33)34-17-35-27)23(37-40)8-5-18-14-19(6-9-24(18)41)28(42)36-21-7-4-20(22(15-21)29(30,31)32)16-39-12-10-38(2)11-13-39/h4,6-7,9,14-15,17,41H,3,10-13,16H2,1-2H3,(H,36,42)(H2,33,34,35)
n/an/a 3.19E+3n/an/an/an/an/an/a
Sichuan University
Curated by ChEMBL
Assay Description
Inhibition of human Src
J Med Chem 58: 3957-74 (2015)
Article DOI: 10.1021/acs.jmedchem.5b00270
BindingDB Entry DOI: 10.7270/Q2J38V91