BDBM50086503 2-(5-Thiocyanato-benzofuran-2-yl)-4,5-dihydro-1H-imidazole::CHEMBL157351::cid_6603748
SMILES: N#CSc1ccc2oc(cc2c1)C1=NCCN1
InChI Key: InChIKey=BMGBHVTUOPUVRW-UHFFFAOYSA-N
Data: 1 KI  4 IC50
Activity Spreadsheet -- Enzyme Inhibition Constant Data from BindingDB
Found 5 hits for monomerid = 50086503
Trg + Lig
Ki
nM
ΔG°
kcal/mole
IC50
nM
Kd
nM
EC50/IC50
nM
koff
s-1
kon
M-1s-1
pHTemp
°C
Adrenergic receptor alpha-2
(RAT-NEONATAL RAT-Rattus norvegicus (rat))
BDBM50086503
(2-(5-Thiocyanato-benzofuran-2-yl)-4,5-dihydro-1H-i...)
Show SMILES N#CSc1ccc2oc(cc2c1)C1=NCCN1 |t:14|
Show InChI InChI=1S/C12H9N3OS/c13-7-17-9-1-2-10-8(5-9)6-11(16-10)12-14-3-4-15-12/h1-2,5-6H,3-4H2,(H,14,15)
1.63E+4n/an/an/an/an/an/an/an/a
University of Bristol
Curated by ChEMBL
Assay Description
Inhibition of 1 nM [3H]RX-821002 binding to rat whole brain membrane Alpha-2 adrenergic receptors
Bioorg Med Chem Lett 10: 605-7 (2000)
BindingDB Entry DOI: 10.7270/Q2PR7V63
Bfl-1
(Mus musculus (Mouse))
BDBM50086503
(2-(5-Thiocyanato-benzofuran-2-yl)-4,5-dihydro-1H-i...)
Show SMILES N#CSc1ccc2oc(cc2c1)C1=NCCN1 |t:14|
Show InChI InChI=1S/C12H9N3OS/c13-7-17-9-1-2-10-8(5-9)6-11(16-10)12-14-3-4-15-12/h1-2,5-6H,3-4H2,(H,14,15)
PCBioAssay
n/an/a 6.11E+3n/an/an/an/an/an/a
Burnham Center for Chemical Genomics
Curated by PubChem BioAssay
Assay Description
Data Source: Sanford-Burnham Center for Chemical Genomics (SBCCG) Source Affiliation: Sanford-Burnham Medical Research Institute (SBMRI, San Diego CA...
PubChem Bioassay (2011)
BindingDB Entry DOI: 10.7270/Q25D8Q92
Imidazoline receptor 1 (I1R)
(Homo sapiens (Human))
BDBM50086503
(2-(5-Thiocyanato-benzofuran-2-yl)-4,5-dihydro-1H-i...)
Show SMILES N#CSc1ccc2oc(cc2c1)C1=NCCN1 |t:14|
Show InChI InChI=1S/C12H9N3OS/c13-7-17-9-1-2-10-8(5-9)6-11(16-10)12-14-3-4-15-12/h1-2,5-6H,3-4H2,(H,14,15)
n/an/a 8.10E+3n/an/an/an/an/an/a
University of Bristol
Curated by ChEMBL
Assay Description
Inhibition of 3 nM [3H]-clonidine binding to rat kidney membrane imidazoline receptor I-1 in presence of rauwolscine
Bioorg Med Chem Lett 10: 605-7 (2000)
BindingDB Entry DOI: 10.7270/Q2PR7V63
ubiquitin-conjugating enzyme E2 N
(Homo sapiens (Human))
BDBM50086503
(2-(5-Thiocyanato-benzofuran-2-yl)-4,5-dihydro-1H-i...)
Show SMILES N#CSc1ccc2oc(cc2c1)C1=NCCN1 |t:14|
Show InChI InChI=1S/C12H9N3OS/c13-7-17-9-1-2-10-8(5-9)6-11(16-10)12-14-3-4-15-12/h1-2,5-6H,3-4H2,(H,14,15)
Reactome pathway
PCBioAssay
n/an/a 4.58E+3n/an/an/an/an/an/a
Burnham Center for Chemical Genomics
Curated by PubChem BioAssay
Assay Description
Data Source: Sanford-Burnham Center for Chemical Genomics (SBCCG) Source Affiliation: Sanford-Burnham Medical Research Institute (SBMRI, San Diego CA...
PubChem Bioassay (2011)
BindingDB Entry DOI: 10.7270/Q2SB4462
ubiquitin-conjugating enzyme E2 N
(Homo sapiens (Human))
BDBM50086503
(2-(5-Thiocyanato-benzofuran-2-yl)-4,5-dihydro-1H-i...)
Show SMILES N#CSc1ccc2oc(cc2c1)C1=NCCN1 |t:14|
Show InChI InChI=1S/C12H9N3OS/c13-7-17-9-1-2-10-8(5-9)6-11(16-10)12-14-3-4-15-12/h1-2,5-6H,3-4H2,(H,14,15)
Reactome pathway
PCBioAssay
n/an/a 5.92E+3n/an/an/an/an/an/a
Burnham Center for Chemical Genomics
Curated by PubChem BioAssay
Assay Description
Data Source: Sanford-Burnham Center for Chemical Genomics (SBCCG) Source Affiliation: Sanford-Burnham Medical Research Institute (SBMRI, San Diego CA...
PubChem Bioassay (2011)
BindingDB Entry DOI: 10.7270/Q2X34VX0