null
SMILES: [H][C@]1(NC(=O)[C@](C)(Cc2ccccc2F)NC(=O)[C@H](CCC(=O)NCCCC[C@H](NC(=O)[C@H](CO)NC1=O)C(=O)N[C@@H](Cc1ccc(cc1)-c1ccc(OC)cc1CC)C(=O)N[C@@H](CCCc1ccccc1)C(N)=O)NC(=O)CNC(=O)[C@H](CCC(O)=O)NC(=O)C(C)(C)NC(=O)[C@@H](N)Cc1cnc[nH]1)[C@@H](C)O
InChI Key:
Activity Spreadsheet -- Enzyme Inhibition Constant Data from BindingDB
Found 2 hits for monomerid = 50086591
Trg + Lig
Ki
nM
ΔG°
kcal/mole
IC50
nM
Kd
nM
EC50/IC50
nM
koff
s-1
kon
M-1s-1
pHTemp
°C
Glucagon-like peptide 1 receptor
(Homo sapiens (Human))
BDBM50086591
(CHEMBL3426246)
Show SMILES [H][C@]1(NC(=O)[C@](C)(Cc2ccccc2F)NC(=O)[C@H](CCC(=O)NCCCC[C@H](NC(=O)[C@H](CO)NC1=O)C(=O)N[C@@H](Cc1ccc(cc1)-c1ccc(OC)cc1CC)C(=O)N[C@@H](CCCc1ccccc1)C(N)=O)NC(=O)CNC(=O)[C@H](CCC(O)=O)NC(=O)C(C)(C)NC(=O)[C@@H](N)Cc1cnc[nH]1)[C@@H](C)O |r|
n/an/an/an/a 430n/an/an/an/a
University of Queensland
Curated by ChEMBL
Assay Description
Agonist activity at human GLP-1R expressed in CHO cells assessed as cAMP accumulation incubated for 30 mins
J Med Chem 58: 4080-5 (2015)
Article DOI: 10.1021/acs.jmedchem.5b00166
BindingDB Entry DOI: 10.7270/Q2DB83KP
Glucagon-like peptide 1 receptor
(Homo sapiens (Human))
BDBM50086591
(CHEMBL3426246)
Show SMILES [H][C@]1(NC(=O)[C@](C)(Cc2ccccc2F)NC(=O)[C@H](CCC(=O)NCCCC[C@H](NC(=O)[C@H](CO)NC1=O)C(=O)N[C@@H](Cc1ccc(cc1)-c1ccc(OC)cc1CC)C(=O)N[C@@H](CCCc1ccccc1)C(N)=O)NC(=O)CNC(=O)[C@H](CCC(O)=O)NC(=O)C(C)(C)NC(=O)[C@@H](N)Cc1cnc[nH]1)[C@@H](C)O |r|
320n/an/an/an/an/an/an/an/a
University of Queensland
Curated by ChEMBL
Assay Description
Displacement of [125I]-17 from human GLP-1R expressed in CHO cell membranes incubated for 120 mins by scintillation counting based radioligand bindin...
J Med Chem 58: 4080-5 (2015)
Article DOI: 10.1021/acs.jmedchem.5b00166
BindingDB Entry DOI: 10.7270/Q2DB83KP