BDBM50087124 CHEMBL3426641
SMILES: COC(=O)c1cccc(NC(=O)c2cccc(c2)-c2cc(ccc2CN)C(=O)Nc2ccncc2F)c1F
InChI Key: InChIKey=JYEUHWFQIDPBIO-UHFFFAOYSA-N
Data: 2 IC50
Activity Spreadsheet -- Enzyme Inhibition Constant Data from BindingDB
Found 2 hits for monomerid = 50087124
Trg + Lig
Ki
nM
ΔG°
kcal/mole
IC50
nM
Kd
nM
EC50/IC50
nM
koff
s-1
kon
M-1s-1
pHTemp
°C
Rho-associated protein kinase 2
(Homo sapiens (Human))
BDBM50087124
(CHEMBL3426641)
Show SMILES COC(=O)c1cccc(NC(=O)c2cccc(c2)-c2cc(ccc2CN)C(=O)Nc2ccncc2F)c1F
Show InChI InChI=1S/C28H22F2N4O4/c1-38-28(37)20-6-3-7-24(25(20)30)34-26(35)17-5-2-4-16(12-17)21-13-18(8-9-19(21)14-31)27(36)33-23-10-11-32-15-22(23)29/h2-13,15H,14,31H2,1H3,(H,34,35)(H,32,33,36)
n/an/a 1.20n/an/an/an/an/an/a
Agoralaan Abis
Curated by ChEMBL
Assay Description
Inhibition of human N-terminal GST-tagged ROCK2 expressed in baculovirus-infected insect cells using long S6 kinase peptide as substrate by radiometr...
J Med Chem 58: 4309-24 (2015)
Article DOI: 10.1021/acs.jmedchem.5b00308
BindingDB Entry DOI: 10.7270/Q2H41T4R
Rho-associated protein kinase 2
(Homo sapiens (Human))
BDBM50087124
(CHEMBL3426641)
Show SMILES COC(=O)c1cccc(NC(=O)c2cccc(c2)-c2cc(ccc2CN)C(=O)Nc2ccncc2F)c1F
Show InChI InChI=1S/C28H22F2N4O4/c1-38-28(37)20-6-3-7-24(25(20)30)34-26(35)17-5-2-4-16(12-17)21-13-18(8-9-19(21)14-31)27(36)33-23-10-11-32-15-22(23)29/h2-13,15H,14,31H2,1H3,(H,34,35)(H,32,33,36)
n/an/a 8.80n/an/an/an/an/an/a
Agoralaan Abis
Curated by ChEMBL
Assay Description
Inhibition of human N-terminal GST-tagged ROCK2 expressed in baculovirus-infected insect cells using long S6 kinase peptide as substrate by radiometr...
J Med Chem 58: 4309-24 (2015)
Article DOI: 10.1021/acs.jmedchem.5b00308
BindingDB Entry DOI: 10.7270/Q2H41T4R