BDBM50087283 CHEMBL3426638
SMILES: CCCOC(=O)c1cccc(c1)C(=O)Nc1cccc(c1)-c1cc(ccc1CN)C(=O)Nc1ccncc1F
InChI Key: InChIKey=VYHBFHRRIDDVDP-UHFFFAOYSA-N
Data: 1 IC50
Activity Spreadsheet -- Enzyme Inhibition Constant Data from BindingDB
Found 1 hit for monomerid = 50087283
Trg + Lig
Ki
nM
ΔG°
kcal/mole
IC50
nM
Kd
nM
EC50/IC50
nM
koff
s-1
kon
M-1s-1
pHTemp
°C
Rho-associated protein kinase 2
(Homo sapiens (Human))
BDBM50087283
(CHEMBL3426638)
Show SMILES CCCOC(=O)c1cccc(c1)C(=O)Nc1cccc(c1)-c1cc(ccc1CN)C(=O)Nc1ccncc1F
Show InChI InChI=1S/C30H27FN4O4/c1-2-13-39-30(38)22-7-3-6-20(14-22)28(36)34-24-8-4-5-19(15-24)25-16-21(9-10-23(25)17-32)29(37)35-27-11-12-33-18-26(27)31/h3-12,14-16,18H,2,13,17,32H2,1H3,(H,34,36)(H,33,35,37)
n/an/a 1.80n/an/an/an/an/an/a
Agoralaan Abis
Curated by ChEMBL
Assay Description
Inhibition of human N-terminal GST-tagged ROCK2 expressed in baculovirus-infected insect cells using long S6 kinase peptide as substrate by radiometr...
J Med Chem 58: 4309-24 (2015)
Article DOI: 10.1021/acs.jmedchem.5b00308
BindingDB Entry DOI: 10.7270/Q2H41T4R