BDBM50087667 10-{4-[(Biphenyl-2-carbonyl)-amino]-2-chloro-benzoyl}-10,11-dihydro-5H-benzo[e]pyrrolo[1,2-a][1,4]diazepine-3-carboxylic acid::CHEMBL349141
SMILES: OC(=O)c1ccc2CN(C(=O)c3ccc(NC(=O)c4ccccc4-c4ccccc4)cc3Cl)c3ccccc3Cn12
InChI Key: InChIKey=DFOAYHSUDNEEHG-UHFFFAOYSA-N
Data: 1 IC50
Activity Spreadsheet -- Enzyme Inhibition Constant Data from BindingDB
Found 1 hit for monomerid = 50087667
Trg + Lig
Ki
nM
ΔG°
kcal/mole
IC50
nM
Kd
nM
EC50/IC50
nM
koff
s-1
kon
M-1s-1
pHTemp
°C
Vasopressin V2 receptor
(Homo sapiens (Human))
BDBM50087667
(10-{4-[(Biphenyl-2-carbonyl)-amino]-2-chloro-benzo...)
Show SMILES OC(=O)c1ccc2CN(C(=O)c3ccc(NC(=O)c4ccccc4-c4ccccc4)cc3Cl)c3ccccc3Cn12
Show InChI InChI=1S/C33H24ClN3O4/c34-28-18-23(35-31(38)26-12-6-5-11-25(26)21-8-2-1-3-9-21)14-16-27(28)32(39)37-20-24-15-17-30(33(40)41)36(24)19-22-10-4-7-13-29(22)37/h1-18H,19-20H2,(H,35,38)(H,40,41)
n/an/a 4n/an/an/an/an/an/a
Wyeth-Ayerst Research
Curated by ChEMBL
Assay Description
Displacement of [3H]-AVP from human vasopressin V2-receptor expressed in murine fibroblast cell (LV2) membranes
Bioorg Med Chem Lett 10: 783-6 (2000)
BindingDB Entry DOI: 10.7270/Q24M93RK