BDBM50088212 2-Amino-4-but-2-enyl-pentanedioic acid(LY339180)::CHEMBL294139
SMILES: C\C=C\C[C@H](C[C@H](N)C(O)=O)C(O)=O
InChI Key: InChIKey=SEHOBMVXPBLACF-DIZYNNQWSA-N
Data: 2 KI  2 EC50
Activity Spreadsheet -- Enzyme Inhibition Constant Data from BindingDB
Found 4 hits for monomerid = 50088212
Trg + Lig
Ki
nM
ΔG°
kcal/mole
IC50
nM
Kd
nM
EC50/IC50
nM
koff
s-1
kon
M-1s-1
pHTemp
°C
GRIK1
(Homo sapiens (Human))
BDBM50088212
(2-Amino-4-but-2-enyl-pentanedioic acid(LY339180) |...)
Show SMILES C\C=C\C[C@H](C[C@H](N)C(O)=O)C(O)=O
Show InChI InChI=1S/C9H15NO4/c1-2-3-4-6(8(11)12)5-7(10)9(13)14/h2-3,6-7H,4-5,10H2,1H3,(H,11,12)(H,13,14)/b3-2+/t6-,7+/m1/s1
21n/an/an/an/an/an/an/an/a
Lilly, S.A.
Curated by ChEMBL
Assay Description
Binding affinity against human ionotropic glutamate receptor kainate 1 in HK293 cells using [3H]-kainate as radioligand
J Med Chem 43: 1958-68 (2000)
BindingDB Entry DOI: 10.7270/Q2FX78QB
Glutamate receptor ionotropic, kainate 2
(Homo sapiens (Human))
BDBM50088212
(2-Amino-4-but-2-enyl-pentanedioic acid(LY339180) |...)
Show SMILES C\C=C\C[C@H](C[C@H](N)C(O)=O)C(O)=O
Show InChI InChI=1S/C9H15NO4/c1-2-3-4-6(8(11)12)5-7(10)9(13)14/h2-3,6-7H,4-5,10H2,1H3,(H,11,12)(H,13,14)/b3-2+/t6-,7+/m1/s1
3.26E+3n/an/an/an/an/an/an/an/a
Lilly, S.A.
Curated by ChEMBL
Assay Description
Binding affinity against human ionotropic glutamate receptor ionotropic kainate 2 in HEK293 cells using [3H]-kainate as radioligand
J Med Chem 43: 1958-68 (2000)
BindingDB Entry DOI: 10.7270/Q2FX78QB
GRIK1
(Homo sapiens (Human))
BDBM50088212
(2-Amino-4-but-2-enyl-pentanedioic acid(LY339180) |...)
Show SMILES C\C=C\C[C@H](C[C@H](N)C(O)=O)C(O)=O
Show InChI InChI=1S/C9H15NO4/c1-2-3-4-6(8(11)12)5-7(10)9(13)14/h2-3,6-7H,4-5,10H2,1H3,(H,11,12)(H,13,14)/b3-2+/t6-,7+/m1/s1
n/an/an/an/a 4.50E+3n/an/an/an/a
Lilly, S.A.
Curated by ChEMBL
Assay Description
Effective concentration of the compound required for evoking response in HEK293 cell
J Med Chem 43: 1958-68 (2000)
BindingDB Entry DOI: 10.7270/Q2FX78QB
Glutamate receptor ionotropic, kainate 2
(Homo sapiens (Human))
BDBM50088212
(2-Amino-4-but-2-enyl-pentanedioic acid(LY339180) |...)
Show SMILES C\C=C\C[C@H](C[C@H](N)C(O)=O)C(O)=O
Show InChI InChI=1S/C9H15NO4/c1-2-3-4-6(8(11)12)5-7(10)9(13)14/h2-3,6-7H,4-5,10H2,1H3,(H,11,12)(H,13,14)/b3-2+/t6-,7+/m1/s1
n/an/an/an/a 5.83E+4n/an/an/an/a
Lilly, S.A.
Curated by ChEMBL
Assay Description
Effective concentration against human GluR6 expressed in HEK293 cells
J Med Chem 43: 1958-68 (2000)
BindingDB Entry DOI: 10.7270/Q2FX78QB