BDBM50088302 CHEMBL56565::Dimethyl-(tetrahydro-pyran-4-yl)-(4-{[7-(4-trifluoromethyl-phenyl)-2,3-dihydro-benzo[b]oxepine-4-carbonyl]-amino}-benzyl)-ammonium; iodide
SMILES: C[N+](C)(Cc1ccc(NC(=O)C2=Cc3cc(ccc3OCC2)-c2ccc(cc2)C(F)(F)F)cc1)C1CCOCC1
InChI Key: InChIKey=JUEYXIWASNAVBU-UHFFFAOYSA-O
Data: 1 IC50
Activity Spreadsheet -- Enzyme Inhibition Constant Data from BindingDB
Found 1 hit for monomerid = 50088302
Trg + Lig
Ki
nM
ΔG°
kcal/mole
IC50
nM
Kd
nM
EC50/IC50
nM
koff
s-1
kon
M-1s-1
pHTemp
°C
C-C chemokine receptor type 5
(Homo sapiens (Human))
BDBM50088302
(CHEMBL56565 | Dimethyl-(tetrahydro-pyran-4-yl)-(4-...)
Show SMILES C[N+](C)(Cc1ccc(NC(=O)C2=Cc3cc(ccc3OCC2)-c2ccc(cc2)C(F)(F)F)cc1)C1CCOCC1 |t:11|
Show InChI InChI=1S/C32H33F3N2O3/c1-37(2,29-14-16-39-17-15-29)21-22-3-10-28(11-4-22)36-31(38)25-13-18-40-30-12-7-24(19-26(30)20-25)23-5-8-27(9-6-23)32(33,34)35/h3-12,19-20,29H,13-18,21H2,1-2H3/p+1
n/an/a 1.5n/an/an/an/an/an/a
Takeda Chemical Industries, Ltd.
Curated by ChEMBL
Assay Description
Inhibitory effect on Chemokine binding to C-C chemokine receptor type 5 using [125I]-RANTES
J Med Chem 43: 2049-63 (2000)
BindingDB Entry DOI: 10.7270/Q26D5S75