BDBM50088309 1-Methyl-1-{4-[(7-p-tolyl-2,3-dihydro-benzo[b]oxepine-4-carbonyl)-amino]-benzyl}-piperidinium; iodide::CHEMBL61267
SMILES: Cc1ccc(cc1)-c1ccc2OCCC(=Cc2c1)C(=O)Nc1ccc(C[N+]2(C)CCCCC2)cc1
InChI Key: InChIKey=YCLWOGPIRAHCJA-UHFFFAOYSA-O
Data: 1 IC50
Activity Spreadsheet -- Enzyme Inhibition Constant Data from BindingDB
Found 1 hit for monomerid = 50088309
Trg + Lig
Ki
nM
ΔG°
kcal/mole
IC50
nM
Kd
nM
EC50/IC50
nM
koff
s-1
kon
M-1s-1
pHTemp
°C
C-C chemokine receptor type 5
(Homo sapiens (Human))
BDBM50088309
(1-Methyl-1-{4-[(7-p-tolyl-2,3-dihydro-benzo[b]oxep...)
Show SMILES Cc1ccc(cc1)-c1ccc2OCCC(=Cc2c1)C(=O)Nc1ccc(C[N+]2(C)CCCCC2)cc1 |c:15|
Show InChI InChI=1S/C31H34N2O2/c1-23-6-10-25(11-7-23)26-12-15-30-28(20-26)21-27(16-19-35-30)31(34)32-29-13-8-24(9-14-29)22-33(2)17-4-3-5-18-33/h6-15,20-21H,3-5,16-19,22H2,1-2H3/p+1
n/an/a 43n/an/an/an/an/an/a
Takeda Chemical Industries, Ltd.
Curated by ChEMBL
Assay Description
Inhibitory effect on Chemokine binding to C-C chemokine receptor type 5 using [125I]-RANTES
J Med Chem 43: 2049-63 (2000)
BindingDB Entry DOI: 10.7270/Q26D5S75