BDBM50088331 CHEMBL3427750
SMILES: NC(=O)C1CCCc2c1[nH]nc2-c1ccc(Cl)c(F)c1
InChI Key: InChIKey=HGQZMWBIINZNDS-UHFFFAOYSA-N
Data: 1 IC50
Activity Spreadsheet -- Enzyme Inhibition Constant Data from BindingDB
Found 1 hit for monomerid = 50088331
Trg + Lig
Ki
nM
ΔG°
kcal/mole
IC50
nM
Kd
nM
EC50/IC50
nM
koff
s-1
kon
M-1s-1
pHTemp
°C
NAD-Dependent Deacetylase Sirtuin-1
(Homo sapiens (Human))
BDBM50088331
(CHEMBL3427750)
Show SMILES NC(=O)C1CCCc2c1[nH]nc2-c1ccc(Cl)c(F)c1
Show InChI InChI=1S/C14H13ClFN3O/c15-10-5-4-7(6-11(10)16)12-8-2-1-3-9(14(17)20)13(8)19-18-12/h4-6,9H,1-3H2,(H2,17,20)(H,18,19)
NCI pathway
Reactome pathway
n/an/a 2.60E+3n/an/an/an/an/an/a
MethylGene Inc.
Curated by ChEMBL
Assay Description
Inhibition of His-tagged human recombinant SIRT1 expressed in Escherichia coli using Cbz-Lys(Ac)-AMC as substrate by fluorescence assay
Bioorg Med Chem Lett 25: 2514-8 (2015)
Article DOI: 10.1016/j.bmcl.2015.04.068
BindingDB Entry DOI: 10.7270/Q2X63PN0