BDBM50088363 CHEMBL2086796
SMILES: O=C(Nc1ccc2nc(Cc3c[nH]c4ccccc34)[nH]c2c1)[C@@H]1CCCN1
InChI Key: InChIKey=FSUGJBWDOIVSMH-SFHVURJKSA-N
Data: 2 Kd
Activity Spreadsheet -- Enzyme Inhibition Constant Data from BindingDB
Found 2 hits for monomerid = 50088363
Trg + Lig
Ki
nM
ΔG°
kcal/mole
IC50
nM
Kd
nM
EC50/IC50
nM
koff
s-1
kon
M-1s-1
pHTemp
°C
GTPase KRas
(Homo sapiens (Human))
BDBM50088363
(CHEMBL2086796)
Show SMILES O=C(Nc1ccc2nc(Cc3c[nH]c4ccccc34)[nH]c2c1)[C@@H]1CCCN1 |r|
Show InChI InChI=1S/C21H21N5O/c27-21(18-6-3-9-22-18)24-14-7-8-17-19(11-14)26-20(25-17)10-13-12-23-16-5-2-1-4-15(13)16/h1-2,4-5,7-8,11-12,18,22-23H,3,6,9-10H2,(H,24,27)(H,25,26)/t18-/m0/s1
Reactome pathway
n/an/an/a 1.90E+5n/an/an/an/an/a
Stony Brook University
Curated by ChEMBL
Assay Description
Binding affinity to KRAS (unknown origin)
J Med Chem 58: 9063-88 (2015)
Article DOI: 10.1021/acs.jmedchem.5b00586
BindingDB Entry DOI: 10.7270/Q24T6NC6
GTPase KRas
(Homo sapiens (Human))
BDBM50088363
(CHEMBL2086796)
Show SMILES O=C(Nc1ccc2nc(Cc3c[nH]c4ccccc34)[nH]c2c1)[C@@H]1CCCN1 |r|
Show InChI InChI=1S/C21H21N5O/c27-21(18-6-3-9-22-18)24-14-7-8-17-19(11-14)26-20(25-17)10-13-12-23-16-5-2-1-4-15(13)16/h1-2,4-5,7-8,11-12,18,22-23H,3,6,9-10H2,(H,24,27)(H,25,26)/t18-/m0/s1
Reactome pathway
n/an/an/a 3.40E+5n/an/an/an/an/a
Pfizer Inc.
Curated by ChEMBL
Assay Description
Binding affinity to KRas (unknown origin)
Bioorg Med Chem Lett 25: 2461-8 (2015)
Article DOI: 10.1016/j.bmcl.2015.04.089
BindingDB Entry DOI: 10.7270/Q2SF2XVC