BDBM50088384 BARNIDIPINE::Barnidipine::Barnidipine HCl
SMILES: COC(=O)C1=C(C)NC(C)=C([C@H]1c1cccc(c1)[N+]([O-])=O)C(=O)O[C@H]1CCN(Cc2ccccc2)C1
InChI Key: InChIKey=VXMOONUMYLCFJD-DHLKQENFSA-N
Data: 3 IC50
Activity Spreadsheet -- Enzyme Inhibition Constant Data from BindingDB
Found 3 hits for monomerid = 50088384
Trg + Lig
Ki
nM
ΔG°
kcal/mole
IC50
nM
Kd
nM
EC50/IC50
nM
koff
s-1
kon
M-1s-1
pHTemp
°C
Calcium channel (Type L)
(Homo sapiens (Human))
BDBM50088384
(BARNIDIPINE | Barnidipine | Barnidipine HCl)
Show SMILES COC(=O)C1=C(C)NC(C)=C([C@H]1c1cccc(c1)[N+]([O-])=O)C(=O)O[C@H]1CCN(Cc2ccccc2)C1 |c:4,9|
Show InChI InChI=1S/C27H29N3O6/c1-17-23(26(31)35-3)25(20-10-7-11-21(14-20)30(33)34)24(18(2)28-17)27(32)36-22-12-13-29(16-22)15-19-8-5-4-6-9-19/h4-11,14,22,25,28H,12-13,15-16H2,1-3H3/t22-,25-/m0/s1
n/an/a 1.20E+3n/an/an/an/an/an/a
Jagiellonian University
Curated by ChEMBL
Assay Description
Inhibition of L-type calcium channel measured using whole-cell patch clamp in guinea pig ventricular myocytes
J Appl Toxicol 32: 858-66 (2012)
Article DOI: 10.1002/jat.2784
BindingDB Entry DOI: 10.7270/Q2D79D5C
Multidrug resistance protein 1/Multidrug resistance associated protein 1
(Homo sapiens (Human))
BDBM50088384
(BARNIDIPINE | Barnidipine | Barnidipine HCl)
Show SMILES COC(=O)C1=C(C)NC(C)=C([C@H]1c1cccc(c1)[N+]([O-])=O)C(=O)O[C@H]1CCN(Cc2ccccc2)C1 |c:4,9|
Show InChI InChI=1S/C27H29N3O6/c1-17-23(26(31)35-3)25(20-10-7-11-21(14-20)30(33)34)24(18(2)28-17)27(32)36-22-12-13-29(16-22)15-19-8-5-4-6-9-19/h4-11,14,22,25,28H,12-13,15-16H2,1-3H3/t22-,25-/m0/s1
n/an/a 1.26E+4n/an/an/an/an/an/a
Kyoto Pharmaceutical University
Curated by ChEMBL
Assay Description
TP_TRANSPORTER: inhibition of Digoxin transepithelial transport (basal to apical) (Digoxin: 0.1 uM) in MDR1-expressing LLC-PK1 cells
Eur J Pharm Sci 16: 159-65 (2002)
Article DOI: 10.1016/s0928-0987(02)00082-9
BindingDB Entry DOI: 10.7270/Q25X2CTJ
Calcium channel (Type L)
(Homo sapiens (Human))
BDBM50088384
(BARNIDIPINE | Barnidipine | Barnidipine HCl)
Show SMILES COC(=O)C1=C(C)NC(C)=C([C@H]1c1cccc(c1)[N+]([O-])=O)C(=O)O[C@H]1CCN(Cc2ccccc2)C1 |c:4,9|
Show InChI InChI=1S/C27H29N3O6/c1-17-23(26(31)35-3)25(20-10-7-11-21(14-20)30(33)34)24(18(2)28-17)27(32)36-22-12-13-29(16-22)15-19-8-5-4-6-9-19/h4-11,14,22,25,28H,12-13,15-16H2,1-3H3/t22-,25-/m0/s1
n/an/a 3.10E+3n/an/an/an/an/an/a
Jagiellonian University
Curated by ChEMBL
Assay Description
Inhibition of L-type calcium channel measured using 2-electrode voltage-clamp in Xenopus oocyte heterologically expressing alpha-1C subunit
J Appl Toxicol 32: 858-66 (2012)
Article DOI: 10.1002/jat.2784
BindingDB Entry DOI: 10.7270/Q2D79D5C