BDBM50088646 5-((R)-Pyrrolidin-3-yloxy)-[3,4']bipyridinyl::CHEMBL10153
SMILES: C1C[C@H](CN1)Oc1cncc(c1)-c1ccncc1
InChI Key: InChIKey=FJCJTVWDUMXKHO-CYBMUJFWSA-N
Data: 1 IC50
Activity Spreadsheet -- Enzyme Inhibition Constant Data from BindingDB
Found 1 hit for monomerid = 50088646
Trg + Lig
Ki
nM
ΔG°
kcal/mole
IC50
nM
Kd
nM
EC50/IC50
nM
koff
s-1
kon
M-1s-1
pHTemp
°C
Neuronal acetylcholine receptor protein alpha-4/beta-2 subunit
(Rattus norvegicus (Rat))
BDBM50088646
(5-((R)-Pyrrolidin-3-yloxy)-[3,4']bipyridinyl | CHE...)
Show SMILES C1C[C@H](CN1)Oc1cncc(c1)-c1ccncc1
Show InChI InChI=1S/C14H15N3O/c1-4-15-5-2-11(1)12-7-14(10-17-8-12)18-13-3-6-16-9-13/h1-2,4-5,7-8,10,13,16H,3,6,9H2/t13-/m1/s1
n/an/a 571n/an/an/an/an/an/a
R.W. Johnson Pharmaceutical Research Institute
Curated by ChEMBL
Assay Description
Evaluated for binding affinity towards nicotinic acetylcholine receptor alpha4-beta2
Bioorg Med Chem Lett 10: 1063-6 (2000)
BindingDB Entry DOI: 10.7270/Q2PK0HBC