BDBM50089048 CHEMBL18163::N,N-Dimethyl-C-[4-(4-phenylamino-quinazolin-2-ylamino)-phenyl]-methanesulfonamide
SMILES: CN(C)S(=O)(=O)Cc1ccc(Nc2nc(Nc3ccccc3)c3ccccc3n2)cc1
InChI Key: InChIKey=UTIXWCYZIWQAAW-UHFFFAOYSA-N
Data: 1 IC50
Activity Spreadsheet -- Enzyme Inhibition Constant Data from BindingDB
Found 1 hit for monomerid = 50089048
Trg + Lig
Ki
nM
ΔG°
kcal/mole
IC50
nM
Kd
nM
EC50/IC50
nM
koff
s-1
kon
M-1s-1
pHTemp
°C
Neuropeptide Y receptor type 5 ( NPY Y5)
(Homo sapiens (Human))
BDBM50089048
(CHEMBL18163 | N,N-Dimethyl-C-[4-(4-phenylamino-qui...)
Show SMILES CN(C)S(=O)(=O)Cc1ccc(Nc2nc(Nc3ccccc3)c3ccccc3n2)cc1
Show InChI InChI=1S/C23H23N5O2S/c1-28(2)31(29,30)16-17-12-14-19(15-13-17)25-23-26-21-11-7-6-10-20(21)22(27-23)24-18-8-4-3-5-9-18/h3-15H,16H2,1-2H3,(H2,24,25,26,27)
n/an/a 0.900n/an/an/an/an/an/a
Novartis Pharma AG
Curated by ChEMBL
Assay Description
Antagonistic activity against neuropeptide Y receptor type 5 subtype stably expressed in LM(tk-)cells
Bioorg Med Chem Lett 10: 1175-9 (2000)
BindingDB Entry DOI: 10.7270/Q2KH0MJP