BDBM50089081 CHEMBL3577637
SMILES: COc1ccc(cc1)N1C(=O)\C(=C\c2ccc(OCC(=O)Nc3ccccc3C)cc2)N=C1c1ccccc1
InChI Key: InChIKey=VSVKHFWIYYHCFM-BRPDVVIDSA-N
Data: 3 IC50
Activity Spreadsheet -- Enzyme Inhibition Constant Data from BindingDB
Found 3 hits for monomerid = 50089081
Trg + Lig
Ki
nM
ΔG°
kcal/mole
IC50
nM
Kd
nM
EC50/IC50
nM
koff
s-1
kon
M-1s-1
pHTemp
°C
Mitogen-activated protein kinase 14
(Homo sapiens (Human))
BDBM50089081
(CHEMBL3577637)
Show SMILES COc1ccc(cc1)N1C(=O)\C(=C\c2ccc(OCC(=O)Nc3ccccc3C)cc2)N=C1c1ccccc1 |c:34|
Show InChI InChI=1S/C32H27N3O4/c1-22-8-6-7-11-28(22)33-30(36)21-39-27-16-12-23(13-17-27)20-29-32(37)35(25-14-18-26(38-2)19-15-25)31(34-29)24-9-4-3-5-10-24/h3-20H,21H2,1-2H3,(H,33,36)/b29-20-
NCI pathway
Reactome pathway
n/an/a 56n/an/an/an/an/an/a
Cairo University
Curated by ChEMBL
Assay Description
Inhibition of p38alpha MAP kinase (unknown origin) using GFP-ATF2 as substrate after 1 hr by TR-FRET assay
Eur J Med Chem 94: 397-404 (2015)
Article DOI: 10.1016/j.ejmech.2015.03.008
BindingDB Entry DOI: 10.7270/Q2BZ67SV
Mitogen-activated protein kinase 3
(Homo sapiens (Human))
BDBM50089081
(CHEMBL3577637)
Show SMILES COc1ccc(cc1)N1C(=O)\C(=C\c2ccc(OCC(=O)Nc3ccccc3C)cc2)N=C1c1ccccc1 |c:34|
Show InChI InChI=1S/C32H27N3O4/c1-22-8-6-7-11-28(22)33-30(36)21-39-27-16-12-23(13-17-27)20-29-32(37)35(25-14-18-26(38-2)19-15-25)31(34-29)24-9-4-3-5-10-24/h3-20H,21H2,1-2H3,(H,33,36)/b29-20-
Reactome pathway
n/an/a 32n/an/an/an/an/an/a
Cairo University
Curated by ChEMBL
Assay Description
Inhibition of ERK1 (unknown origin) using GFP-ATF2 as substrate after 1 hr by TR-FRET assay
Eur J Med Chem 94: 397-404 (2015)
Article DOI: 10.1016/j.ejmech.2015.03.008
BindingDB Entry DOI: 10.7270/Q2BZ67SV
Mitogen-activated protein kinase 1
(Homo sapiens (Human))
BDBM50089081
(CHEMBL3577637)
Show SMILES COc1ccc(cc1)N1C(=O)\C(=C\c2ccc(OCC(=O)Nc3ccccc3C)cc2)N=C1c1ccccc1 |c:34|
Show InChI InChI=1S/C32H27N3O4/c1-22-8-6-7-11-28(22)33-30(36)21-39-27-16-12-23(13-17-27)20-29-32(37)35(25-14-18-26(38-2)19-15-25)31(34-29)24-9-4-3-5-10-24/h3-20H,21H2,1-2H3,(H,33,36)/b29-20-
NCI pathway
Reactome pathway
n/an/a 23n/an/an/an/an/an/a
Cairo University
Curated by ChEMBL
Assay Description
Inhibition of ERK2 (unknown origin) using GFP-ATF2 as substrate after 1 hr by TR-FRET assay
Eur J Med Chem 94: 397-404 (2015)
Article DOI: 10.1016/j.ejmech.2015.03.008
BindingDB Entry DOI: 10.7270/Q2BZ67SV