BDBM50089108 CHEMBL3577727
SMILES: COC[C@H](C)Oc1cc(cc(c1)C(=O)Nc1ccn(C)n1)C#Cc1cccc(NCCN(C)C)c1
InChI Key: InChIKey=HYNFNSKOKNVWOK-FQEVSTJZSA-N
Data: 1 EC50
Activity Spreadsheet -- Enzyme Inhibition Constant Data from BindingDB
Found 1 hit for monomerid = 50089108
Trg + Lig
Ki
nM
ΔG°
kcal/mole
IC50
nM
Kd
nM
EC50/IC50
nM
koff
s-1
kon
M-1s-1
pHTemp
°C
Glucokinase/Glucokinase regulatory protein
(Homo sapiens (Human))
BDBM50089108
(CHEMBL3577727)
Show SMILES COC[C@H](C)Oc1cc(cc(c1)C(=O)Nc1ccn(C)n1)C#Cc1cccc(NCCN(C)C)c1 |r|
Show InChI InChI=1S/C27H33N5O3/c1-20(19-34-5)35-25-17-22(15-23(18-25)27(33)29-26-11-13-32(4)30-26)10-9-21-7-6-8-24(16-21)28-12-14-31(2)3/h6-8,11,13,15-18,20,28H,12,14,19H2,1-5H3,(H,29,30,33)/t20-/m0/s1
NCI pathway
Reactome pathway
n/an/an/an/a 6n/an/an/an/a
Yuhan Research Institute
Curated by ChEMBL
Assay Description
Activation of recombinant human pancreatic glucokinase using 10 mM glucose as substrate by G6PDH coupled assay
ACS Med Chem Lett 6: 296-301 (2015)
Article DOI: 10.1021/ml5004712
BindingDB Entry DOI: 10.7270/Q2ZP47VT