BDBM50089136 CHEMBL3577730
SMILES: COC[C@H](C)Oc1cc(cc(c1)C(=O)Nc1ccn(C)n1)C#Cc1cccc(NCCN2CCOCC2)c1
InChI Key: InChIKey=XLHQJZBPWPNFJN-QFIPXVFZSA-N
Data: 1 EC50
Activity Spreadsheet -- Enzyme Inhibition Constant Data from BindingDB
Found 1 hit for monomerid = 50089136
Trg + Lig
Ki
nM
ΔG°
kcal/mole
IC50
nM
Kd
nM
EC50/IC50
nM
koff
s-1
kon
M-1s-1
pHTemp
°C
Glucokinase/Glucokinase regulatory protein
(Homo sapiens (Human))
BDBM50089136
(CHEMBL3577730)
Show SMILES COC[C@H](C)Oc1cc(cc(c1)C(=O)Nc1ccn(C)n1)C#Cc1cccc(NCCN2CCOCC2)c1 |r|
Show InChI InChI=1S/C29H35N5O4/c1-22(21-36-3)38-27-19-24(17-25(20-27)29(35)31-28-9-11-33(2)32-28)8-7-23-5-4-6-26(18-23)30-10-12-34-13-15-37-16-14-34/h4-6,9,11,17-20,22,30H,10,12-16,21H2,1-3H3,(H,31,32,35)/t22-/m0/s1
NCI pathway
Reactome pathway
n/an/an/an/a 20n/an/an/an/a
Yuhan Research Institute
Curated by ChEMBL
Assay Description
Activation of recombinant human pancreatic glucokinase using 10 mM glucose as substrate by G6PDH coupled assay
ACS Med Chem Lett 6: 296-301 (2015)
Article DOI: 10.1021/ml5004712
BindingDB Entry DOI: 10.7270/Q2ZP47VT