BDBM50089174 CHEMBL3577721
SMILES: COC[C@H](C)Oc1cc(cc(c1)C(=O)Nc1ccn(C)n1)C#Cc1ccc2OCOc2c1
InChI Key: InChIKey=VYSDEEMKUWOLEP-INIZCTEOSA-N
Data: 1 EC50
Activity Spreadsheet -- Enzyme Inhibition Constant Data from BindingDB
Found 1 hit for monomerid = 50089174
Trg + Lig
Ki
nM
ΔG°
kcal/mole
IC50
nM
Kd
nM
EC50/IC50
nM
koff
s-1
kon
M-1s-1
pHTemp
°C
Glucokinase/Glucokinase regulatory protein
(Homo sapiens (Human))
BDBM50089174
(CHEMBL3577721)
Show SMILES COC[C@H](C)Oc1cc(cc(c1)C(=O)Nc1ccn(C)n1)C#Cc1ccc2OCOc2c1 |r|
Show InChI InChI=1S/C24H23N3O5/c1-16(14-29-3)32-20-11-18(5-4-17-6-7-21-22(12-17)31-15-30-21)10-19(13-20)24(28)25-23-8-9-27(2)26-23/h6-13,16H,14-15H2,1-3H3,(H,25,26,28)/t16-/m0/s1
NCI pathway
Reactome pathway
n/an/an/an/a 30n/an/an/an/a
Yuhan Research Institute
Curated by ChEMBL
Assay Description
Activation of recombinant human pancreatic glucokinase using 10 mM glucose as substrate by G6PDH coupled assay
ACS Med Chem Lett 6: 296-301 (2015)
Article DOI: 10.1021/ml5004712
BindingDB Entry DOI: 10.7270/Q2ZP47VT