BDBM50089176 CHEMBL3577723
SMILES: COC[C@H](C)Oc1cc(cc(c1)C(=O)Nc1ccn(C)n1)C#Cc1cccc(N)c1
InChI Key: InChIKey=JJZHLHHSBFBDFN-INIZCTEOSA-N
Data: 1 EC50
Activity Spreadsheet -- Enzyme Inhibition Constant Data from BindingDB
Found 1 hit for monomerid = 50089176
Trg + Lig
Ki
nM
ΔG°
kcal/mole
IC50
nM
Kd
nM
EC50/IC50
nM
koff
s-1
kon
M-1s-1
pHTemp
°C
Glucokinase/Glucokinase regulatory protein
(Homo sapiens (Human))
BDBM50089176
(CHEMBL3577723)
Show SMILES COC[C@H](C)Oc1cc(cc(c1)C(=O)Nc1ccn(C)n1)C#Cc1cccc(N)c1 |r|
Show InChI InChI=1S/C23H24N4O3/c1-16(15-29-3)30-21-13-18(8-7-17-5-4-6-20(24)12-17)11-19(14-21)23(28)25-22-9-10-27(2)26-22/h4-6,9-14,16H,15,24H2,1-3H3,(H,25,26,28)/t16-/m0/s1
NCI pathway
Reactome pathway
n/an/an/an/a 27n/an/an/an/a
Yuhan Research Institute
Curated by ChEMBL
Assay Description
Activation of recombinant human pancreatic glucokinase using 10 mM glucose as substrate by G6PDH coupled assay
ACS Med Chem Lett 6: 296-301 (2015)
Article DOI: 10.1021/ml5004712
BindingDB Entry DOI: 10.7270/Q2ZP47VT