BDBM50089177 CHEMBL3577732
SMILES: COC[C@H](C)Oc1cc(cc(c1)C(=O)Nc1ccn(C)n1)C#Cc1cccc(NCCn2ccnc2C)c1
InChI Key: InChIKey=PHPGEFZFXQKVHC-NRFANRHFSA-N
Data: 1 EC50
Activity Spreadsheet -- Enzyme Inhibition Constant Data from BindingDB
Found 1 hit for monomerid = 50089177
Trg + Lig
Ki
nM
ΔG°
kcal/mole
IC50
nM
Kd
nM
EC50/IC50
nM
koff
s-1
kon
M-1s-1
pHTemp
°C
Glucokinase/Glucokinase regulatory protein
(Homo sapiens (Human))
BDBM50089177
(CHEMBL3577732)
Show SMILES COC[C@H](C)Oc1cc(cc(c1)C(=O)Nc1ccn(C)n1)C#Cc1cccc(NCCn2ccnc2C)c1 |r|
Show InChI InChI=1S/C29H32N6O3/c1-21(20-37-4)38-27-18-24(16-25(19-27)29(36)32-28-10-13-34(3)33-28)9-8-23-6-5-7-26(17-23)31-12-15-35-14-11-30-22(35)2/h5-7,10-11,13-14,16-19,21,31H,12,15,20H2,1-4H3,(H,32,33,36)/t21-/m0/s1
NCI pathway
Reactome pathway
n/an/an/an/a 9n/an/an/an/a
Yuhan Research Institute
Curated by ChEMBL
Assay Description
Activation of recombinant human pancreatic glucokinase using 10 mM glucose as substrate by G6PDH coupled assay
ACS Med Chem Lett 6: 296-301 (2015)
Article DOI: 10.1021/ml5004712
BindingDB Entry DOI: 10.7270/Q2ZP47VT