BDBM50089180 CHEMBL3577735
SMILES: COC[C@H](C)Oc1cc(cc(c1)C(=O)Nc1ccn(C)n1)C#Cc1cccc(OCCN2CCCC2)c1
InChI Key: InChIKey=CIKTYHYVXWGZSY-QFIPXVFZSA-N
Data: 1 EC50
Activity Spreadsheet -- Enzyme Inhibition Constant Data from BindingDB
Found 1 hit for monomerid = 50089180
Trg + Lig
Ki
nM
ΔG°
kcal/mole
IC50
nM
Kd
nM
EC50/IC50
nM
koff
s-1
kon
M-1s-1
pHTemp
°C
Glucokinase/Glucokinase regulatory protein
(Homo sapiens (Human))
BDBM50089180
(CHEMBL3577735)
Show SMILES COC[C@H](C)Oc1cc(cc(c1)C(=O)Nc1ccn(C)n1)C#Cc1cccc(OCCN2CCCC2)c1 |r|
Show InChI InChI=1S/C29H34N4O4/c1-22(21-35-3)37-27-19-24(17-25(20-27)29(34)30-28-11-14-32(2)31-28)10-9-23-7-6-8-26(18-23)36-16-15-33-12-4-5-13-33/h6-8,11,14,17-20,22H,4-5,12-13,15-16,21H2,1-3H3,(H,30,31,34)/t22-/m0/s1
NCI pathway
Reactome pathway
n/an/an/an/a 6n/an/an/an/a
Yuhan Research Institute
Curated by ChEMBL
Assay Description
Activation of recombinant human pancreatic glucokinase using 10 mM glucose as substrate by G6PDH coupled assay
ACS Med Chem Lett 6: 296-301 (2015)
Article DOI: 10.1021/ml5004712
BindingDB Entry DOI: 10.7270/Q2ZP47VT