null
SMILES: CC1(C)[C@H]2CCC(C)(C2)[C@H]1NS(=O)(=O)c1ccc(F)cc1
InChI Key: InChIKey=PBMVETGVYGTZMP-XPFLZZBLSA-N
Activity Spreadsheet -- Enzyme Inhibition Constant Data from BindingDB
Found 1 hit for monomerid = 50089193
Trg + Lig
Ki
nM
ΔG°
kcal/mole
IC50
nM
Kd
nM
EC50/IC50
nM
koff
s-1
kon
M-1s-1
pHTemp
°C
Amyloid-beta precursor protein
(Homo sapiens (Human))
BDBM50089193
(4-Fluoro-N-(1,3,3-trimethyl-bicyclo[2.2.1]hept-2-y...)
Show SMILES CC1(C)[C@H]2CCC(C)(C2)[C@H]1NS(=O)(=O)c1ccc(F)cc1
Show InChI InChI=1S/C16H22FNO2S/c1-15(2)11-8-9-16(3,10-11)14(15)18-21(19,20)13-6-4-12(17)5-7-13/h4-7,11,14,18H,8-10H2,1-3H3/t11-,14-,16?/m0/s1
Reactome pathway
n/an/a 1.80E+3n/an/an/an/an/an/a
Amgen
Curated by ChEMBL
Assay Description
Inhibition of Abeta42 production by inhibiting Gamma-secretase proteolytic pathway in HEK293 cell stably transfected with a double mutant form of hum...
J Med Chem 43: 2297-9 (2000)
BindingDB Entry DOI: 10.7270/Q25B01QF