BDBM50089253 CHEMBL3577900
SMILES: CC[C@@H](N(Cc1cccc(c1)C(O)=O)C(=O)c1cnc2ccccc2c1)c1ccc(F)cc1
InChI Key: InChIKey=WCYFCFXBUDZUAO-RUZDIDTESA-N
Data: 1 KI  1 IC50
Activity Spreadsheet -- Enzyme Inhibition Constant Data from BindingDB
Found 2 hits for monomerid = 50089253
Trg + Lig
Ki
nM
ΔG°
kcal/mole
IC50
nM
Kd
nM
EC50/IC50
nM
koff
s-1
kon
M-1s-1
pHTemp
°C
Potassium voltage-gated channel subfamily H member 2
(Homo sapiens (Human))
BDBM50089253
(CHEMBL3577900)
Show SMILES CC[C@@H](N(Cc1cccc(c1)C(O)=O)C(=O)c1cnc2ccccc2c1)c1ccc(F)cc1 |r|
Show InChI InChI=1S/C27H23FN2O3/c1-2-25(19-10-12-23(28)13-11-19)30(17-18-6-5-8-21(14-18)27(32)33)26(31)22-15-20-7-3-4-9-24(20)29-16-22/h3-16,25H,2,17H2,1H3,(H,32,33)/t25-/m1/s1
Reactome pathway
>1.52E+4n/an/an/an/an/an/an/an/a
Pfizer Inc.
Curated by ChEMBL
Assay Description
Inhibition of dofetilide binding to human ERG
ACS Med Chem Lett 6: 419-24 (2015)
Article DOI: 10.1021/ml500479v
BindingDB Entry DOI: 10.7270/Q2FQ9ZBC
Transient receptor potential cation channel subfamily M member 8 (TRPM8)
(Homo sapiens (Human))
BDBM50089253
(CHEMBL3577900)
Show SMILES CC[C@@H](N(Cc1cccc(c1)C(O)=O)C(=O)c1cnc2ccccc2c1)c1ccc(F)cc1 |r|
Show InChI InChI=1S/C27H23FN2O3/c1-2-25(19-10-12-23(28)13-11-19)30(17-18-6-5-8-21(14-18)27(32)33)26(31)22-15-20-7-3-4-9-24(20)29-16-22/h3-16,25H,2,17H2,1H3,(H,32,33)/t25-/m1/s1
n/an/a 202n/an/an/an/an/an/a
Pfizer Inc.
Curated by ChEMBL
Assay Description
Antagonist activity against human recombinant TRPM8 expressed in CHO T-rex cells assessed as inhibition of WS12-induced calcium response pre-incubate...
ACS Med Chem Lett 6: 419-24 (2015)
Article DOI: 10.1021/ml500479v
BindingDB Entry DOI: 10.7270/Q2FQ9ZBC