BDBM50089318 CHEMBL3577911
SMILES: COc1ncc(cc1NS(=O)(=O)c1ccc(F)cc1F)-c1ccc2ncnc(-c3ccncc3)c2c1
InChI Key: InChIKey=SXCSSRFIAVDRJT-UHFFFAOYSA-N
Data: 2 IC50
Activity Spreadsheet -- Enzyme Inhibition Constant Data from BindingDB
Found 2 hits for monomerid = 50089318
Trg + Lig
Ki
nM
ΔG°
kcal/mole
IC50
nM
Kd
nM
EC50/IC50
nM
koff
s-1
kon
M-1s-1
pHTemp
°C
Phosphatidylinositol 4,5-bisphosphate 3-kinase catalytic subunit alpha isoform
(Homo sapiens (Human))
BDBM50089318
(CHEMBL3577911)
Show SMILES COc1ncc(cc1NS(=O)(=O)c1ccc(F)cc1F)-c1ccc2ncnc(-c3ccncc3)c2c1
Show InChI InChI=1S/C25H17F2N5O3S/c1-35-25-22(32-36(33,34)23-5-3-18(26)12-20(23)27)11-17(13-29-25)16-2-4-21-19(10-16)24(31-14-30-21)15-6-8-28-9-7-15/h2-14,32H,1H3
NCI pathway
Reactome pathway
n/an/a 0.0950n/an/an/an/an/an/a
PKUCare Pharmaceutical R&D Center
Curated by ChEMBL
Assay Description
Inhibition of PI3Kalpha (unknown origin) using PIP2/PS as substrate after 1 hr by luciferase-based luminescence assay
ACS Med Chem Lett 6: 434-8 (2015)
Article DOI: 10.1021/ml5005014
BindingDB Entry DOI: 10.7270/Q29Z96M1
Serine/threonine-protein kinase mTOR
(Homo sapiens (Human))
BDBM50089318
(CHEMBL3577911)
Show SMILES COc1ncc(cc1NS(=O)(=O)c1ccc(F)cc1F)-c1ccc2ncnc(-c3ccncc3)c2c1
Show InChI InChI=1S/C25H17F2N5O3S/c1-35-25-22(32-36(33,34)23-5-3-18(26)12-20(23)27)11-17(13-29-25)16-2-4-21-19(10-16)24(31-14-30-21)15-6-8-28-9-7-15/h2-14,32H,1H3
NCI pathway
Reactome pathway
n/an/a 0.200n/an/an/an/an/an/a
PKUCare Pharmaceutical R&D Center
Curated by ChEMBL
Assay Description
Inhibition of mTOR (unknown origin) using GFP-4E-BP1 as substrate after 1 hr by TR-FRET assay
ACS Med Chem Lett 6: 434-8 (2015)
Article DOI: 10.1021/ml5005014
BindingDB Entry DOI: 10.7270/Q29Z96M1