BDBM50089414 CHEMBL3577996
SMILES: [H][C@@]12CCCN1C(=O)[C@@]1([H])CCCN1C(=O)[C@H](Cc1ccccc1)NC(=O)[C@H](C)NC(=O)C(CN)NC(=O)[C@H](Cc1ccccc1)NC(=O)[C@H](Cc1ccccc1)NC(=O)[C@H](CCCNC(N)=N)NC2=O
InChI Key: InChIKey=IJUWOYISGCBYSL-KVDLRQQCSA-N
Data: 2 KI  1 EC50
Activity Spreadsheet -- Enzyme Inhibition Constant Data from BindingDB
Found 3 hits for monomerid = 50089414
Trg + Lig
Ki
nM
ΔG°
kcal/mole
IC50
nM
Kd
nM
EC50/IC50
nM
koff
s-1
kon
M-1s-1
pHTemp
°C
Melanocortin receptor 4
(Mus musculus)
BDBM50089414
(CHEMBL3577996)
Show SMILES [H][C@@]12CCCN1C(=O)[C@@]1([H])CCCN1C(=O)[C@H](Cc1ccccc1)NC(=O)[C@H](C)NC(=O)C(CN)NC(=O)[C@H](Cc1ccccc1)NC(=O)[C@H](Cc1ccccc1)NC(=O)[C@H](CCCNC(N)=N)NC2=O |r|
Show InChI InChI=1S/C49H64N12O8/c1-30-41(62)58-37(28-33-18-9-4-10-19-33)47(68)61-25-13-22-40(61)48(69)60-24-12-21-39(60)46(67)55-34(20-11-23-53-49(51)52)42(63)56-35(26-31-14-5-2-6-15-31)43(64)57-36(27-32-16-7-3-8-17-32)44(65)59-38(29-50)45(66)54-30/h2-10,14-19,30,34-40H,11-13,20-29,50H2,1H3,(H,54,66)(H,55,67)(H,56,63)(H,57,64)(H,58,62)(H,59,65)(H4,51,52,53)/t30-,34-,35-,36-,37-,38?,39-,40+/m0/s1
0.790n/an/an/an/an/an/an/an/a
University of Minnesota
Curated by ChEMBL
Assay Description
Displacement of MTII from mouse MC4R expressed in HEK293 cells
J Med Chem 58: 4638-47 (2015)
Article DOI: 10.1021/acs.jmedchem.5b00184
BindingDB Entry DOI: 10.7270/Q2T155C9
Melanocortin receptor 3
(Mus musculus)
BDBM50089414
(CHEMBL3577996)
Show SMILES [H][C@@]12CCCN1C(=O)[C@@]1([H])CCCN1C(=O)[C@H](Cc1ccccc1)NC(=O)[C@H](C)NC(=O)C(CN)NC(=O)[C@H](Cc1ccccc1)NC(=O)[C@H](Cc1ccccc1)NC(=O)[C@H](CCCNC(N)=N)NC2=O |r|
Show InChI InChI=1S/C49H64N12O8/c1-30-41(62)58-37(28-33-18-9-4-10-19-33)47(68)61-25-13-22-40(61)48(69)60-24-12-21-39(60)46(67)55-34(20-11-23-53-49(51)52)42(63)56-35(26-31-14-5-2-6-15-31)43(64)57-36(27-32-16-7-3-8-17-32)44(65)59-38(29-50)45(66)54-30/h2-10,14-19,30,34-40H,11-13,20-29,50H2,1H3,(H,54,66)(H,55,67)(H,56,63)(H,57,64)(H,58,62)(H,59,65)(H4,51,52,53)/t30-,34-,35-,36-,37-,38?,39-,40+/m0/s1
Reactome pathway
130n/an/an/an/an/an/an/an/a
University of Minnesota
Curated by ChEMBL
Assay Description
Displacement of MTII from mouse MC3R expressed in HEK293 cells
J Med Chem 58: 4638-47 (2015)
Article DOI: 10.1021/acs.jmedchem.5b00184
BindingDB Entry DOI: 10.7270/Q2T155C9
Melanocortin receptor 5 (MC5R)
(Mus musculus (Mouse))
BDBM50089414
(CHEMBL3577996)
Show SMILES [H][C@@]12CCCN1C(=O)[C@@]1([H])CCCN1C(=O)[C@H](Cc1ccccc1)NC(=O)[C@H](C)NC(=O)C(CN)NC(=O)[C@H](Cc1ccccc1)NC(=O)[C@H](Cc1ccccc1)NC(=O)[C@H](CCCNC(N)=N)NC2=O |r|
Show InChI InChI=1S/C49H64N12O8/c1-30-41(62)58-37(28-33-18-9-4-10-19-33)47(68)61-25-13-22-40(61)48(69)60-24-12-21-39(60)46(67)55-34(20-11-23-53-49(51)52)42(63)56-35(26-31-14-5-2-6-15-31)43(64)57-36(27-32-16-7-3-8-17-32)44(65)59-38(29-50)45(66)54-30/h2-10,14-19,30,34-40H,11-13,20-29,50H2,1H3,(H,54,66)(H,55,67)(H,56,63)(H,57,64)(H,58,62)(H,59,65)(H4,51,52,53)/t30-,34-,35-,36-,37-,38?,39-,40+/m0/s1
n/an/an/an/a>1.00E+8n/an/an/an/a
University of Minnesota
Curated by ChEMBL
Assay Description
Agonist activity at mouse MC5R expressed in HEK293 cells by cAMP functional bioassay
J Med Chem 58: 4638-47 (2015)
Article DOI: 10.1021/acs.jmedchem.5b00184
BindingDB Entry DOI: 10.7270/Q2T155C9